BDBM50095412 5-tert-Butyl-3-(3-p-tolyl-ureido)-thiophene-2-carboxylic acid 2-hydroxy-ethyl ester::CHEMBL277806
SMILES: Cc1ccc(NC(=O)Nc2cc(sc2C(=O)OCCO)C(C)(C)C)cc1
InChI Key: InChIKey=XKOLCHQZSYHRED-UHFFFAOYSA-N
Data: 1 IC50
Activity Spreadsheet -- Enzyme Inhibition Constant Data from BindingDB
Found 1 hit for monomerid = 50095412
Trg + Lig
Ki
nM
ΔG°
kcal/mole
IC50
nM
Kd
nM
EC50/IC50
nM
koff
s-1
kon
M-1s-1
pHTemp
°C
Mitogen-activated protein kinase 14
(Homo sapiens (Human))
BDBM50095412
(5-tert-Butyl-3-(3-p-tolyl-ureido)-thiophene-2-carb...)
Show SMILES Cc1ccc(NC(=O)Nc2cc(sc2C(=O)OCCO)C(C)(C)C)cc1
Show InChI InChI=1S/C19H24N2O4S/c1-12-5-7-13(8-6-12)20-18(24)21-14-11-15(19(2,3)4)26-16(14)17(23)25-10-9-22/h5-8,11,22H,9-10H2,1-4H3,(H2,20,21,24)
NCI pathway
Reactome pathway
n/an/a 57n/an/an/an/an/an/a
Bayer Research Center
Curated by ChEMBL
Assay Description
Inhibition of Mitogen-activated protein kinase p38 alpha 2
Bioorg Med Chem Lett 11: 9-12 (2001)
BindingDB Entry DOI: 10.7270/Q2JM28WH