BDBM50095418 5-tert-Butyl-3-[3-(4-fluoro-phenyl)-ureido]-furan-2-carboxylic acid methyl ester::CHEMBL18286
SMILES: COC(=O)c1oc(cc1NC(=O)Nc1ccc(F)cc1)C(C)(C)C
InChI Key: InChIKey=GSKCWDUWHKSXRR-UHFFFAOYSA-N
Data: 1 IC50
Activity Spreadsheet -- Enzyme Inhibition Constant Data from BindingDB
Found 1 hit for monomerid = 50095418
Trg + Lig
Ki
nM
ΔG°
kcal/mole
IC50
nM
Kd
nM
EC50/IC50
nM
koff
s-1
kon
M-1s-1
pHTemp
°C
Mitogen-activated protein kinase 14
(Homo sapiens (Human))
BDBM50095418
(5-tert-Butyl-3-[3-(4-fluoro-phenyl)-ureido]-furan-...)
Show SMILES COC(=O)c1oc(cc1NC(=O)Nc1ccc(F)cc1)C(C)(C)C
Show InChI InChI=1S/C17H19FN2O4/c1-17(2,3)13-9-12(14(24-13)15(21)23-4)20-16(22)19-11-7-5-10(18)6-8-11/h5-9H,1-4H3,(H2,19,20,22)
NCI pathway
Reactome pathway
n/an/a 210n/an/an/an/an/an/a
Bayer Research Center
Curated by ChEMBL
Assay Description
In vitro inhibition of mitogen-activated protein kinase p38 alpha 2 derived from E. coli
Bioorg Med Chem Lett 11: 9-12 (2001)
BindingDB Entry DOI: 10.7270/Q2JM28WH