BDBM50095541 1-(4-Butoxy-benzenesulfonyl)-4-morpholin-4-yl-pyrrolidine-2-carboxylic acid hydroxyamide::CHEMBL344999
SMILES: CCCCOc1ccc(cc1)S(=O)(=O)N1C[C@H](C[C@@H]1C(=O)NO)N1CCOCC1
InChI Key: InChIKey=PDYICDUZWJCQQF-MAUKXSAKSA-N
Data: 5 IC50
Activity Spreadsheet -- Enzyme Inhibition Constant Data from BindingDB
Found 5 hits for monomerid = 50095541
Trg + Lig
Ki
nM
ΔG°
kcal/mole
IC50
nM
Kd
nM
EC50/IC50
nM
koff
s-1
kon
M-1s-1
pHTemp
°C
Stromelysin-1
(Homo sapiens (Human))
BDBM50095541
(1-(4-Butoxy-benzenesulfonyl)-4-morpholin-4-yl-pyrr...)
Show SMILES CCCCOc1ccc(cc1)S(=O)(=O)N1C[C@H](C[C@@H]1C(=O)NO)N1CCOCC1
Show InChI InChI=1S/C19H29N3O6S/c1-2-3-10-28-16-4-6-17(7-5-16)29(25,26)22-14-15(13-18(22)19(23)20-24)21-8-11-27-12-9-21/h4-7,15,18,24H,2-3,8-14H2,1H3,(H,20,23)/t15-,18+/m0/s1
Reactome pathway
n/an/a 5n/an/an/an/an/an/a
Procter and Gamble Pharmaceuticals
Curated by ChEMBL
Assay Description
In vitro inhibitory activity against matrix metalloproteinase -3 (stromelysin)
J Med Chem 43: 4948-63 (2001)
BindingDB Entry DOI: 10.7270/Q21N80DW
Matrix metalloproteinase-7 (MMP7)
(Homo sapiens (Human))
BDBM50095541
(1-(4-Butoxy-benzenesulfonyl)-4-morpholin-4-yl-pyrr...)
Show SMILES CCCCOc1ccc(cc1)S(=O)(=O)N1C[C@H](C[C@@H]1C(=O)NO)N1CCOCC1
Show InChI InChI=1S/C19H29N3O6S/c1-2-3-10-28-16-4-6-17(7-5-16)29(25,26)22-14-15(13-18(22)19(23)20-24)21-8-11-27-12-9-21/h4-7,15,18,24H,2-3,8-14H2,1H3,(H,20,23)/t15-,18+/m0/s1
Reactome pathway
n/an/a 5.40E+3n/an/an/an/an/an/a
Procter and Gamble Pharmaceuticals
Curated by ChEMBL
Assay Description
In vitro inhibitory activity against matrix metalloproteinase-7 (matrilysin, MMP-7)
J Med Chem 43: 4948-63 (2001)
BindingDB Entry DOI: 10.7270/Q21N80DW
Interstitial collagenase
(Homo sapiens (Human))
BDBM50095541
(1-(4-Butoxy-benzenesulfonyl)-4-morpholin-4-yl-pyrr...)
Show SMILES CCCCOc1ccc(cc1)S(=O)(=O)N1C[C@H](C[C@@H]1C(=O)NO)N1CCOCC1
Show InChI InChI=1S/C19H29N3O6S/c1-2-3-10-28-16-4-6-17(7-5-16)29(25,26)22-14-15(13-18(22)19(23)20-24)21-8-11-27-12-9-21/h4-7,15,18,24H,2-3,8-14H2,1H3,(H,20,23)/t15-,18+/m0/s1
Reactome pathway
n/an/a 920n/an/an/an/an/an/a
Procter and Gamble Pharmaceuticals
Curated by ChEMBL
Assay Description
In vitro inhibitory activity against matrix metalloproteinase -1 (collagenase-1)
J Med Chem 43: 4948-63 (2001)
BindingDB Entry DOI: 10.7270/Q21N80DW
72 kDa type IV collagenase
(Homo sapiens (Human))
BDBM50095541
(1-(4-Butoxy-benzenesulfonyl)-4-morpholin-4-yl-pyrr...)
Show SMILES CCCCOc1ccc(cc1)S(=O)(=O)N1C[C@H](C[C@@H]1C(=O)NO)N1CCOCC1
Show InChI InChI=1S/C19H29N3O6S/c1-2-3-10-28-16-4-6-17(7-5-16)29(25,26)22-14-15(13-18(22)19(23)20-24)21-8-11-27-12-9-21/h4-7,15,18,24H,2-3,8-14H2,1H3,(H,20,23)/t15-,18+/m0/s1
Reactome pathway
n/an/a 4n/an/an/an/an/an/a
Procter and Gamble Pharmaceuticals
Curated by ChEMBL
Assay Description
In vitro inhibitory activity against matrix metalloproteinase -2 (gelatinase-A)
J Med Chem 43: 4948-63 (2001)
BindingDB Entry DOI: 10.7270/Q21N80DW
Collagenase 3
(Homo sapiens (Human))
BDBM50095541
(1-(4-Butoxy-benzenesulfonyl)-4-morpholin-4-yl-pyrr...)
Show SMILES CCCCOc1ccc(cc1)S(=O)(=O)N1C[C@H](C[C@@H]1C(=O)NO)N1CCOCC1
Show InChI InChI=1S/C19H29N3O6S/c1-2-3-10-28-16-4-6-17(7-5-16)29(25,26)22-14-15(13-18(22)19(23)20-24)21-8-11-27-12-9-21/h4-7,15,18,24H,2-3,8-14H2,1H3,(H,20,23)/t15-,18+/m0/s1
NCI pathway
Reactome pathway
n/an/a 0.600n/an/an/an/an/an/a
Procter and Gamble Pharmaceuticals
Curated by ChEMBL
Assay Description
Inhibition of matrix metalloproteinase-13 (collagenase-3)
J Med Chem 43: 4948-63 (2001)
BindingDB Entry DOI: 10.7270/Q21N80DW