BDBM50095644 CHEMBL3590448
SMILES: [O-][N+](=O)c1ccc(CCN(CCOc2ccc(cc2)[N+]([O-])=O)CC#N)cc1
InChI Key: InChIKey=ROGNVHKKAHEZOJ-UHFFFAOYSA-N
Data: 1 KI  1 Kd
Activity Spreadsheet -- Enzyme Inhibition Constant Data from BindingDB
Found 2 hits for monomerid = 50095644
Trg + Lig
Ki
nM
ΔG°
kcal/mole
IC50
nM
Kd
nM
EC50/IC50
nM
koff
s-1
kon
M-1s-1
pHTemp
°C
Potassium voltage-gated channel subfamily H member 2
(Homo sapiens (Human))
BDBM50095644
(CHEMBL3590448)
Show SMILES [O-][N+](=O)c1ccc(CCN(CCOc2ccc(cc2)[N+]([O-])=O)CC#N)cc1
Show InChI InChI=1S/C18H18N4O5/c19-10-12-20(11-9-15-1-3-16(4-2-15)21(23)24)13-14-27-18-7-5-17(6-8-18)22(25)26/h1-8H,9,11-14H2
Reactome pathway
203n/an/an/an/an/an/an/an/a
Leiden University
Curated by ChEMBL
Assay Description
Displacement of [3H]dofetilide from human Kv11.1 expressed in HEK293 cell membranes by competitive radioligand displacement assay
J Med Chem 58: 5916-29 (2015)
Article DOI: 10.1021/acs.jmedchem.5b00518
BindingDB Entry DOI: 10.7270/Q2FX7C6V
Potassium voltage-gated channel subfamily H member 2
(Homo sapiens (Human))
BDBM50095644
(CHEMBL3590448)
Show SMILES [O-][N+](=O)c1ccc(CCN(CCOc2ccc(cc2)[N+]([O-])=O)CC#N)cc1
Show InChI InChI=1S/C18H18N4O5/c19-10-12-20(11-9-15-1-3-16(4-2-15)21(23)24)13-14-27-18-7-5-17(6-8-18)22(25)26/h1-8H,9,11-14H2
Reactome pathway
n/an/an/a 99n/an/an/an/an/a
Leiden University
Curated by ChEMBL
Assay Description
Binding affinity to human Kv11.1 expressed in HEK293 cell membranes assessed as binding affinity constant by [3H]dofetilide competition association a...
J Med Chem 58: 5916-29 (2015)
Article DOI: 10.1021/acs.jmedchem.5b00518
BindingDB Entry DOI: 10.7270/Q2FX7C6V