null
SMILES: OC(=O)CN(CCOc1ccc(cc1)[N+]([O-])=O)CCc1ccc(cc1)[N+]([O-])=O
InChI Key: InChIKey=AFAKQMFVFSCGKW-UHFFFAOYSA-N
Activity Spreadsheet -- Enzyme Inhibition Constant Data from BindingDB
Found 2 hits for monomerid = 50095645
Trg + Lig
Ki
nM
ΔG°
kcal/mole
IC50
nM
Kd
nM
EC50/IC50
nM
koff
s-1
kon
M-1s-1
pHTemp
°C
Potassium voltage-gated channel subfamily H member 2
(Homo sapiens (Human))
BDBM50095645
(CHEMBL3590449)
Show SMILES OC(=O)CN(CCOc1ccc(cc1)[N+]([O-])=O)CCc1ccc(cc1)[N+]([O-])=O
Show InChI InChI=1S/C18H19N3O7/c22-18(23)13-19(10-9-14-1-3-15(4-2-14)20(24)25)11-12-28-17-7-5-16(6-8-17)21(26)27/h1-8H,9-13H2,(H,22,23)
Reactome pathway
588n/an/an/an/an/an/an/an/a
Leiden University
Curated by ChEMBL
Assay Description
Displacement of [3H]dofetilide from human Kv11.1 expressed in HEK293 cell membranes by competitive radioligand displacement assay
J Med Chem 58: 5916-29 (2015)
Article DOI: 10.1021/acs.jmedchem.5b00518
BindingDB Entry DOI: 10.7270/Q2FX7C6V
Potassium voltage-gated channel subfamily H member 2
(Homo sapiens (Human))
BDBM50095645
(CHEMBL3590449)
Show SMILES OC(=O)CN(CCOc1ccc(cc1)[N+]([O-])=O)CCc1ccc(cc1)[N+]([O-])=O
Show InChI InChI=1S/C18H19N3O7/c22-18(23)13-19(10-9-14-1-3-15(4-2-14)20(24)25)11-12-28-17-7-5-16(6-8-17)21(26)27/h1-8H,9-13H2,(H,22,23)
Reactome pathway
n/an/an/a 260n/an/an/an/an/a
Leiden University
Curated by ChEMBL
Assay Description
Binding affinity to human Kv11.1 expressed in HEK293 cell membranes assessed as binding affinity constant by [3H]dofetilide competition association a...
J Med Chem 58: 5916-29 (2015)
Article DOI: 10.1021/acs.jmedchem.5b00518
BindingDB Entry DOI: 10.7270/Q2FX7C6V