BDBM50095709 3-(8-Hydroxy-6,11-dimethyl-1,2,5,6-tetrahydro-4H-2,6-methano-benzo[d]azocin-3-yl)-propionitrile::CHEMBL148086
SMILES: CC1C2Cc3ccc(O)cc3[C@@]1(C)CCN2CCC#N
InChI Key: InChIKey=DHJAHFWTVDJKOO-SEFLRBGSSA-N
Data: 3 KI
Activity Spreadsheet -- Enzyme Inhibition Constant Data from BindingDB
Found 3 hits for monomerid = 50095709
Trg + Lig
Ki
nM
ΔG°
kcal/mole
IC50
nM
Kd
nM
EC50/IC50
nM
koff
s-1
kon
M-1s-1
pHTemp
°C
Sigma non-opioid intracellular receptor 1
(RAT)
BDBM50095709
(3-(8-Hydroxy-6,11-dimethyl-1,2,5,6-tetrahydro-4H-2...)
Show SMILES CC1C2Cc3ccc(O)cc3[C@@]1(C)CCN2CCC#N |TLB:16:15:1:10.4.3,9:10:1:15.13.14|
Show InChI InChI=1S/C17H22N2O/c1-12-16-10-13-4-5-14(20)11-15(13)17(12,2)6-9-19(16)8-3-7-18/h4-5,11-12,16,20H,3,6,8-10H2,1-2H3/t12?,16?,17-/m0/s1
250n/an/an/an/an/an/an/an/a
Virginia Commonwealth University
Curated by ChEMBL
Assay Description
Ki value determined against Sigma opioid receptor type 1 using [(+)-[3H]pentazocaine at the Kd concentration 2nM .
J Med Chem 43: 5030-6 (2001)
BindingDB Entry DOI: 10.7270/Q2CV4H0C
Kappa-type opioid receptor
(Mus musculus (Mouse))
BDBM50095709
(3-(8-Hydroxy-6,11-dimethyl-1,2,5,6-tetrahydro-4H-2...)
Show SMILES CC1C2Cc3ccc(O)cc3[C@@]1(C)CCN2CCC#N |TLB:16:15:1:10.4.3,9:10:1:15.13.14|
Show InChI InChI=1S/C17H22N2O/c1-12-16-10-13-4-5-14(20)11-15(13)17(12,2)6-9-19(16)8-3-7-18/h4-5,11-12,16,20H,3,6,8-10H2,1-2H3/t12?,16?,17-/m0/s1
600n/an/an/an/an/an/an/an/a
Virginia Commonwealth University
Curated by ChEMBL
Assay Description
Ki value determined against Opioid receptor kappa 1 using [3H]U69, 593 at the Kd concentration 0.95 nM
J Med Chem 43: 5030-6 (2001)
BindingDB Entry DOI: 10.7270/Q2CV4H0C
Sigma non-opioid intracellular receptor 1
(RAT)
BDBM50095709
(3-(8-Hydroxy-6,11-dimethyl-1,2,5,6-tetrahydro-4H-2...)
Show SMILES CC1C2Cc3ccc(O)cc3[C@@]1(C)CCN2CCC#N |TLB:16:15:1:10.4.3,9:10:1:15.13.14|
Show InChI InChI=1S/C17H22N2O/c1-12-16-10-13-4-5-14(20)11-15(13)17(12,2)6-9-19(16)8-3-7-18/h4-5,11-12,16,20H,3,6,8-10H2,1-2H3/t12?,16?,17-/m0/s1
>1.00E+5n/an/an/an/an/an/an/an/a
Virginia Commonwealth University
Curated by ChEMBL
Assay Description
Ki value determined against Sigma opioid receptor type 2 using [3H]DTG(5nM) with 1microM dextrallorphan to mask sigma1 binding
J Med Chem 43: 5030-6 (2001)
BindingDB Entry DOI: 10.7270/Q2CV4H0C