null
SMILES: Clc1ccc(cc1)C(=O)C1CCN(CCc2ccc(Cl)c(Cl)c2)CC1
InChI Key: InChIKey=JYOUATXRHWNDDW-UCJDAUIDSA-N
Activity Spreadsheet -- Enzyme Inhibition Constant Data from BindingDB
Found 2 hits for monomerid = 50095734
Trg + Lig
Ki
nM
ΔG°
kcal/mole
IC50
nM
Kd
nM
EC50/IC50
nM
koff
s-1
kon
M-1s-1
pHTemp
°C
Potassium voltage-gated channel subfamily H member 2
(Homo sapiens (Human))
BDBM50095734
(CHEMBL3590456)
Show SMILES Clc1ccc(cc1)C(=O)C1CCN(CCc2ccc(Cl)c(Cl)c2)CC1
Show InChI InChI=1S/C37H38N4O6/c38-30(19-26-15-17-29(42)18-16-26)36(45)41-23-28-14-8-7-13-27(28)22-33(41)35(44)39-31(20-24-9-3-1-4-10-24)34(43)40-32(37(46)47)21-25-11-5-2-6-12-25/h1-18,30-33,42H,19-23,38H2,(H,39,44)(H,40,43)(H,46,47)/t30?,31-,32-,33-/m0/s1
Reactome pathway
54n/an/an/an/an/an/an/an/a
Leiden University
Curated by ChEMBL
Assay Description
Displacement of [3H]dofetilide from human Kv11.1 expressed in HEK293 cell membranes by competitive radioligand displacement assay
J Med Chem 58: 5916-29 (2015)
Article DOI: 10.1021/acs.jmedchem.5b00518
BindingDB Entry DOI: 10.7270/Q2FX7C6V
Potassium voltage-gated channel subfamily H member 2
(Homo sapiens (Human))
BDBM50095734
(CHEMBL3590456)
Show SMILES Clc1ccc(cc1)C(=O)C1CCN(CCc2ccc(Cl)c(Cl)c2)CC1
Show InChI InChI=1S/C37H38N4O6/c38-30(19-26-15-17-29(42)18-16-26)36(45)41-23-28-14-8-7-13-27(28)22-33(41)35(44)39-31(20-24-9-3-1-4-10-24)34(43)40-32(37(46)47)21-25-11-5-2-6-12-25/h1-18,30-33,42H,19-23,38H2,(H,39,44)(H,40,43)(H,46,47)/t30?,31-,32-,33-/m0/s1
Reactome pathway
n/an/an/a 36n/an/an/an/an/a
Leiden University
Curated by ChEMBL
Assay Description
Binding affinity to human Kv11.1 expressed in HEK293 cell membranes assessed as binding affinity constant by [3H]dofetilide competition association a...
J Med Chem 58: 5916-29 (2015)
Article DOI: 10.1021/acs.jmedchem.5b00518
BindingDB Entry DOI: 10.7270/Q2FX7C6V