BDBM50095774 5-Cyclopropyl-9,10-dimethyl-5,10-dihydro-4,5,6,10-tetraaza-dibenzo[a,d]cyclohepten-11-one::CHEMBL291267
SMILES: CN1c2c(C)ccnc2N(C2CC2)c2ncccc2C1=O
InChI Key: InChIKey=AROAJCGIVIHNIF-UHFFFAOYSA-N
Data: 1 IC50
Activity Spreadsheet -- Enzyme Inhibition Constant Data from BindingDB
Found 1 hit for monomerid = 50095774
Trg + Lig
Ki
nM
ΔG°
kcal/mole
IC50
nM
Kd
nM
EC50/IC50
nM
koff
s-1
kon
M-1s-1
pHTemp
°C
Human immunodeficiency virus type 1 reverse transcriptase
(Human immunodeficiency virus 1)
BDBM50095774
(5-Cyclopropyl-9,10-dimethyl-5,10-dihydro-4,5,6,10-...)
Show SMILES CN1c2c(C)ccnc2N(C2CC2)c2ncccc2C1=O
Show InChI InChI=1S/C16H16N4O/c1-10-7-9-18-15-13(10)19(2)16(21)12-4-3-8-17-14(12)20(15)11-5-6-11/h3-4,7-9,11H,5-6H2,1-2H3
n/an/a>1.00E+3n/an/an/an/an/an/a
Yale University
Curated by ChEMBL
Assay Description
Inhibition of HIV-1 reverse transcriptase at 37 degree Centigrade
J Med Chem 44: 145-54 (2001)
BindingDB Entry DOI: 10.7270/Q2VX0FRX