BDBM50095793 1-[6-Amino-8-(3-fluoro-phenyl)-9-methyl-9H-purin-2-ylethynyl]-cyclohexanol::CHEMBL48153
SMILES: Cn1c(nc2c(N)nc(nc12)C#CC1(O)CCCCC1)-c1cccc(F)c1
InChI Key: InChIKey=PSJFQTPTZIHBKW-UHFFFAOYSA-N
Data: 3 KI  1 IC50
Activity Spreadsheet -- Enzyme Inhibition Constant Data from BindingDB
Found 4 hits for monomerid = 50095793
Trg + Lig
Ki
nM
ΔG°
kcal/mole
IC50
nM
Kd
nM
EC50/IC50
nM
koff
s-1
kon
M-1s-1
pHTemp
°C
Adenosine receptor A1
(Homo sapiens (Human))
BDBM50095793
(1-[6-Amino-8-(3-fluoro-phenyl)-9-methyl-9H-purin-2...)
Show SMILES Cn1c(nc2c(N)nc(nc12)C#CC1(O)CCCCC1)-c1cccc(F)c1
Show InChI InChI=1S/C20H20FN5O/c1-26-18(13-6-5-7-14(21)12-13)25-16-17(22)23-15(24-19(16)26)8-11-20(27)9-3-2-4-10-20/h5-7,12,27H,2-4,9-10H2,1H3,(H2,22,23,24)
Reactome pathway
14n/an/an/an/an/an/an/an/a
Eisai Company, Ltd.
Curated by ChEMBL
Assay Description
Binding Affinity towards Adenosine A1 receptor expressed in CHO-K1 cells versus [3H]-CCPA
J Med Chem 44: 170-9 (2001)
BindingDB Entry DOI: 10.7270/Q2R49Q0X
Adenosine receptor A2a
(Homo sapiens (Human))
BDBM50095793
(1-[6-Amino-8-(3-fluoro-phenyl)-9-methyl-9H-purin-2...)
Show SMILES Cn1c(nc2c(N)nc(nc12)C#CC1(O)CCCCC1)-c1cccc(F)c1
Show InChI InChI=1S/C20H20FN5O/c1-26-18(13-6-5-7-14(21)12-13)25-16-17(22)23-15(24-19(16)26)8-11-20(27)9-3-2-4-10-20/h5-7,12,27H,2-4,9-10H2,1H3,(H2,22,23,24)
NCI pathway
Reactome pathway
16n/an/an/an/an/an/an/an/a
Eisai Company, Ltd.
Curated by ChEMBL
Assay Description
Binding Affinity towards Adenosine A2A receptor expressed in HEK-293 cells versus [3H]-CGS-21,680
J Med Chem 44: 170-9 (2001)
BindingDB Entry DOI: 10.7270/Q2R49Q0X
Adenosine receptor A3
(Homo sapiens (Human))
BDBM50095793
(1-[6-Amino-8-(3-fluoro-phenyl)-9-methyl-9H-purin-2...)
Show SMILES Cn1c(nc2c(N)nc(nc12)C#CC1(O)CCCCC1)-c1cccc(F)c1
Show InChI InChI=1S/C20H20FN5O/c1-26-18(13-6-5-7-14(21)12-13)25-16-17(22)23-15(24-19(16)26)8-11-20(27)9-3-2-4-10-20/h5-7,12,27H,2-4,9-10H2,1H3,(H2,22,23,24)
Reactome pathway
540n/an/an/an/an/an/an/an/a
Eisai Company, Ltd.
Curated by ChEMBL
Assay Description
Binding affinity towards adenosine A3 receptor expressed in HEK-293 cells versus [125I]-AB-MECA
J Med Chem 44: 170-9 (2001)
BindingDB Entry DOI: 10.7270/Q2R49Q0X
Adenosine receptor A2b
(Homo sapiens (Human))
BDBM50095793
(1-[6-Amino-8-(3-fluoro-phenyl)-9-methyl-9H-purin-2...)
Show SMILES Cn1c(nc2c(N)nc(nc12)C#CC1(O)CCCCC1)-c1cccc(F)c1
Show InChI InChI=1S/C20H20FN5O/c1-26-18(13-6-5-7-14(21)12-13)25-16-17(22)23-15(24-19(16)26)8-11-20(27)9-3-2-4-10-20/h5-7,12,27H,2-4,9-10H2,1H3,(H2,22,23,24)
NCI pathway
Reactome pathway
n/an/a 23n/an/an/an/an/an/a
Eisai Company, Ltd.
Curated by ChEMBL
Assay Description
Inhibitory activity on NECA-induced cyclic-AMP accumulation in CHO-K1 cells expressing human Adenosine A2B receptor
J Med Chem 44: 170-9 (2001)
BindingDB Entry DOI: 10.7270/Q2R49Q0X