null
SMILES: CCCCN1C(=O)\C(=C\NC2CCCCC2)C(=O)c2cccc(Cl)c12
InChI Key: InChIKey=MYNRELUCFAQMFC-UATKWWGBSA-N
Activity Spreadsheet -- Enzyme Inhibition Constant Data from BindingDB
Found 2 hits for monomerid = 50095859
Trg + Lig
Ki
nM
ΔG°
kcal/mole
IC50
nM
Kd
nM
EC50/IC50
nM
koff
s-1
kon
M-1s-1
pHTemp
°C
Cannabinoid receptor 1
(Homo sapiens (Human))
BDBM50095859
(CHEMBL3590615)
Show SMILES CCCCN1C(=O)\C(=C\NC2CCCCC2)C(=O)c2cccc(Cl)c12
Show InChI InChI=1S/C13H16N6O4/c14-10-6-11(16-3-15-10)19(4-17-6)13-8(21)7(20)9(23-13)12(22)18-5-1-2-5/h3-5,7-9,13,20-21H,1-2H2,(H,18,22)(H2,14,15,16)/t7?,8?,9-,13+/m0/s1
NCI pathway
Reactome pathway
n/an/an/an/a>1.00E+4n/an/an/an/a
Zhejiang University
Curated by ChEMBL
Assay Description
Agonist activity at CB1R (unknown origin) CHO cells stably expressing Galpha16 assessed as increase in intracellular calcium level by microplate read...
J Med Chem 58: 5751-69 (2015)
Article DOI: 10.1021/acs.jmedchem.5b00227
BindingDB Entry DOI: 10.7270/Q2Z039X8
Cannabinoid receptor 2
(Homo sapiens (Human))
BDBM50095859
(CHEMBL3590615)
Show SMILES CCCCN1C(=O)\C(=C\NC2CCCCC2)C(=O)c2cccc(Cl)c12
Show InChI InChI=1S/C13H16N6O4/c14-10-6-11(16-3-15-10)19(4-17-6)13-8(21)7(20)9(23-13)12(22)18-5-1-2-5/h3-5,7-9,13,20-21H,1-2H2,(H,18,22)(H2,14,15,16)/t7?,8?,9-,13+/m0/s1
Reactome pathway
n/an/an/an/a>1.00E+4n/an/an/an/a
Zhejiang University
Curated by ChEMBL
Assay Description
Agonist activity at CB2R (unknown origin) CHO cells stably expressing Galpha16 assessed as increase in intracellular calcium level by microplate read...
J Med Chem 58: 5751-69 (2015)
Article DOI: 10.1021/acs.jmedchem.5b00227
BindingDB Entry DOI: 10.7270/Q2Z039X8