BDBM50096301 CHEMBL3585453
SMILES: Cc1ccncc1-c1cnc(NC2CCNCC2)c2[nH]c(=O)c(C)cc12
InChI Key: InChIKey=WLGPJTDIVUMABC-UHFFFAOYSA-N
Data: 2 IC50
Activity Spreadsheet -- Enzyme Inhibition Constant Data from BindingDB
Found 2 hits for monomerid = 50096301
Trg + Lig
Ki
nM
ΔG°
kcal/mole
IC50
nM
Kd
nM
EC50/IC50
nM
koff
s-1
kon
M-1s-1
pHTemp
°C
Bromodomain-containing protein 4
(Homo sapiens (Human))
BDBM50096301
(CHEMBL3585453)
Show SMILES Cc1ccncc1-c1cnc(NC2CCNCC2)c2[nH]c(=O)c(C)cc12
Show InChI InChI=1S/C20H23N5O/c1-12-3-6-22-10-16(12)17-11-23-19(24-14-4-7-21-8-5-14)18-15(17)9-13(2)20(26)25-18/h3,6,9-11,14,21H,4-5,7-8H2,1-2H3,(H,23,24)(H,25,26)
n/an/a 3.16E+3n/an/an/an/an/an/a
GlaxoSmithKline
Curated by ChEMBL
Assay Description
Displacement of I-BET762 from 6His-Thr-BRD4 (1 to 477) BD1 (unknown origin) harboring BD2 Y390A mutant after 30 mins by TR-FRET analysis
J Med Chem 58: 5649-73 (2015)
Article DOI: 10.1021/acs.jmedchem.5b00772
BindingDB Entry DOI: 10.7270/Q2PR7XQN
ATPase family AAA domain-containing protein 2
(Homo sapiens (Human))
BDBM50096301
(CHEMBL3585453)
Show SMILES Cc1ccncc1-c1cnc(NC2CCNCC2)c2[nH]c(=O)c(C)cc12
Show InChI InChI=1S/C20H23N5O/c1-12-3-6-22-10-16(12)17-11-23-19(24-14-4-7-21-8-5-14)18-15(17)9-13(2)20(26)25-18/h3,6,9-11,14,21H,4-5,7-8H2,1-2H3,(H,23,24)(H,25,26)
n/an/a 1.26E+3n/an/an/an/an/an/a
GlaxoSmithKline
Curated by ChEMBL
Assay Description
Displacement of histone H4 peptide from FLAG-6His-Tev-ATAD2 (981 to 1121) (unknown origin) expressed in Escherichia coli BL21 (DE3) after 30 mins by ...
J Med Chem 58: 5649-73 (2015)
Article DOI: 10.1021/acs.jmedchem.5b00772
BindingDB Entry DOI: 10.7270/Q2PR7XQN