BDBM50096308 CHEMBL3585461
SMILES: Cc1cc2c(cnc(NC3CCNCC3)c2[nH]c1=O)-c1cncc(COC(N)=O)c1
InChI Key: InChIKey=SGVPYWKISHQFFA-PKNBQFBNSA-N
Data: 2 IC50
Activity Spreadsheet -- Enzyme Inhibition Constant Data from BindingDB
Found 2 hits for monomerid = 50096308
Trg + Lig
Ki
nM
ΔG°
kcal/mole
IC50
nM
Kd
nM
EC50/IC50
nM
koff
s-1
kon
M-1s-1
pHTemp
°C
Bromodomain-containing protein 4
(Homo sapiens (Human))
BDBM50096308
(CHEMBL3585461)
Show SMILES Cc1cc2c(cnc(NC3CCNCC3)c2[nH]c1=O)-c1cncc(COC(N)=O)c1
Show InChI InChI=1S/C22H13ClFN3O2/c23-18-6-1-2-7-20(18)27-21(11-9-15-4-3-5-16(13-28)25-15)26-19-10-8-14(24)12-17(19)22(27)29/h1-13H/b11-9+
n/an/a 1.26E+3n/an/an/an/an/an/a
GlaxoSmithKline
Curated by ChEMBL
Assay Description
Displacement of I-BET762 from 6His-Thr-BRD4 (1 to 477) BD1 (unknown origin) harboring BD2 Y390A mutant after 30 mins by TR-FRET analysis
J Med Chem 58: 5649-73 (2015)
Article DOI: 10.1021/acs.jmedchem.5b00772
BindingDB Entry DOI: 10.7270/Q2PR7XQN
ATPase family AAA domain-containing protein 2
(Homo sapiens (Human))
BDBM50096308
(CHEMBL3585461)
Show SMILES Cc1cc2c(cnc(NC3CCNCC3)c2[nH]c1=O)-c1cncc(COC(N)=O)c1
Show InChI InChI=1S/C22H13ClFN3O2/c23-18-6-1-2-7-20(18)27-21(11-9-15-4-3-5-16(13-28)25-15)26-19-10-8-14(24)12-17(19)22(27)29/h1-13H/b11-9+
n/an/a 1.59E+3n/an/an/an/an/an/a
GlaxoSmithKline
Curated by ChEMBL
Assay Description
Displacement of histone H4 peptide from FLAG-6His-Tev-ATAD2 (981 to 1121) (unknown origin) expressed in Escherichia coli BL21 (DE3) after 30 mins by ...
J Med Chem 58: 5649-73 (2015)
Article DOI: 10.1021/acs.jmedchem.5b00772
BindingDB Entry DOI: 10.7270/Q2PR7XQN