BDBM50096318 CHEMBL3586719
SMILES: Cc1cc2c(cnc(NC3CCNCC3)c2[nH]c1=O)-c1ccccc1
InChI Key: InChIKey=YOMVTRPZCWDXIL-MDZDMXLPSA-N
Data: 2 IC50
Activity Spreadsheet -- Enzyme Inhibition Constant Data from BindingDB
Found 2 hits for monomerid = 50096318
Trg + Lig
Ki
nM
ΔG°
kcal/mole
IC50
nM
Kd
nM
EC50/IC50
nM
koff
s-1
kon
M-1s-1
pHTemp
°C
ATPase family AAA domain-containing protein 2
(Homo sapiens (Human))
BDBM50096318
(CHEMBL3586719)
Show SMILES Cc1cc2c(cnc(NC3CCNCC3)c2[nH]c1=O)-c1ccccc1
Show InChI InChI=1S/C22H15Cl2N3O/c1-14-6-2-3-8-19(14)27-20(10-9-16-7-4-5-11-25-16)26-21-17(22(27)28)12-15(23)13-18(21)24/h2-13H,1H3/b10-9+
n/an/a 1.00E+4n/an/an/an/an/an/a
GlaxoSmithKline
Curated by ChEMBL
Assay Description
Displacement of histone H4 peptide from FLAG-6His-Tev-ATAD2 (981 to 1121) (unknown origin) expressed in Escherichia coli BL21 (DE3) after 30 mins by ...
J Med Chem 58: 5649-73 (2015)
Article DOI: 10.1021/acs.jmedchem.5b00772
BindingDB Entry DOI: 10.7270/Q2PR7XQN
Bromodomain-containing protein 4
(Homo sapiens (Human))
BDBM50096318
(CHEMBL3586719)
Show SMILES Cc1cc2c(cnc(NC3CCNCC3)c2[nH]c1=O)-c1ccccc1
Show InChI InChI=1S/C22H15Cl2N3O/c1-14-6-2-3-8-19(14)27-20(10-9-16-7-4-5-11-25-16)26-21-17(22(27)28)12-15(23)13-18(21)24/h2-13H,1H3/b10-9+
n/an/a 794n/an/an/an/an/an/a
GlaxoSmithKline
Curated by ChEMBL
Assay Description
Displacement of I-BET762 from 6His-Thr-BRD4 (1 to 477) BD1 (unknown origin) harboring BD2 Y390A mutant after 30 mins by TR-FRET analysis
J Med Chem 58: 5649-73 (2015)
Article DOI: 10.1021/acs.jmedchem.5b00772
BindingDB Entry DOI: 10.7270/Q2PR7XQN