BDBM50096430 CHEMBL3577155
SMILES: CCCCCCCC\C=C/CCCCCCCCOC[C@@H](O)COP(O)(=O)OC[C@H](N)C(O)=O
InChI Key: InChIKey=CYQYYSHPNYBPLP-UHAUOVHRSA-N
Data: 4 EC50
Activity Spreadsheet -- Enzyme Inhibition Constant Data from BindingDB
Found 4 hits for monomerid = 50096430
Trg + Lig
Ki
nM
ΔG°
kcal/mole
IC50
nM
Kd
nM
EC50/IC50
nM
koff
s-1
kon
M-1s-1
pHTemp
°C
Putative P2Y purinoceptor 10
(Homo sapiens (Human))
BDBM50096430
(CHEMBL3577155)
Show SMILES CCCCCCCC\C=C/CCCCCCCCOC[C@@H](O)COP(O)(=O)OC[C@H](N)C(O)=O |r|
Show InChI InChI=1S/C24H48NO8P/c1-2-3-4-5-6-7-8-9-10-11-12-13-14-15-16-17-18-31-19-22(26)20-32-34(29,30)33-21-23(25)24(27)28/h9-10,22-23,26H,2-8,11-21,25H2,1H3,(H,27,28)(H,29,30)/b10-9-/t22-,23+/m1/s1
n/an/an/an/a 4.47E+3n/an/an/an/a
The University of Tokyo
Curated by ChEMBL
Assay Description
Agonist activity at P2Y10 (unknown origin) transfected in HEK293A cells after 1 hr by TGFalpha shedding assay
J Med Chem 58: 4204-19 (2015)
Article DOI: 10.1021/jm5020082
BindingDB Entry DOI: 10.7270/Q2Q81FTD
Probable G-protein coupled receptor 174
(Homo sapiens (Human))
BDBM50096430
(CHEMBL3577155)
Show SMILES CCCCCCCC\C=C/CCCCCCCCOC[C@@H](O)COP(O)(=O)OC[C@H](N)C(O)=O |r|
Show InChI InChI=1S/C24H48NO8P/c1-2-3-4-5-6-7-8-9-10-11-12-13-14-15-16-17-18-31-19-22(26)20-32-34(29,30)33-21-23(25)24(27)28/h9-10,22-23,26H,2-8,11-21,25H2,1H3,(H,27,28)(H,29,30)/b10-9-/t22-,23+/m1/s1
n/an/an/an/a>1.00E+3n/an/an/an/a
The University of Tokyo
Curated by ChEMBL
Assay Description
Agonist activity at GPR174 (unknown origin) transfected in HEK293FT cells after 1 hr by TGFalpha shedding assay
J Med Chem 58: 4204-19 (2015)
Article DOI: 10.1021/jm5020082
BindingDB Entry DOI: 10.7270/Q2Q81FTD
Putative P2Y purinoceptor 10
(Homo sapiens (Human))
BDBM50096430
(CHEMBL3577155)
Show SMILES CCCCCCCC\C=C/CCCCCCCCOC[C@@H](O)COP(O)(=O)OC[C@H](N)C(O)=O |r|
Show InChI InChI=1S/C24H48NO8P/c1-2-3-4-5-6-7-8-9-10-11-12-13-14-15-16-17-18-31-19-22(26)20-32-34(29,30)33-21-23(25)24(27)28/h9-10,22-23,26H,2-8,11-21,25H2,1H3,(H,27,28)(H,29,30)/b10-9-/t22-,23+/m1/s1
n/an/an/an/a 4.50E+3n/an/an/an/a
The University of Tokyo
Curated by ChEMBL
Assay Description
Agonist activity at P2Y10 (unknown origin) transfected in HEK293A cells after 1 hr by TGFalpha shedding assay
J Med Chem 58: 4204-19 (2015)
Article DOI: 10.1021/jm5020082
BindingDB Entry DOI: 10.7270/Q2Q81FTD
Probable G-protein coupled receptor 34
(Homo sapiens (Human))
BDBM50096430
(CHEMBL3577155)
Show SMILES CCCCCCCC\C=C/CCCCCCCCOC[C@@H](O)COP(O)(=O)OC[C@H](N)C(O)=O |r|
Show InChI InChI=1S/C24H48NO8P/c1-2-3-4-5-6-7-8-9-10-11-12-13-14-15-16-17-18-31-19-22(26)20-32-34(29,30)33-21-23(25)24(27)28/h9-10,22-23,26H,2-8,11-21,25H2,1H3,(H,27,28)(H,29,30)/b10-9-/t22-,23+/m1/s1
n/an/an/an/a>1.00E+3n/an/an/an/a
The University of Tokyo
Curated by ChEMBL
Assay Description
Agonist activity at GPR34 (unknown origin) transfected in HEK293A cells after 1 hr by TGFalpha shedding assay
J Med Chem 58: 4204-19 (2015)
Article DOI: 10.1021/jm5020082
BindingDB Entry DOI: 10.7270/Q2Q81FTD