null
SMILES: CCCCCCCOc1ccccc1CCC(=O)OCCCOP(O)(=O)OC[C@H](N)C(O)=O
InChI Key: InChIKey=FMJWNEQNALGMKR-IBGZPJMESA-N
Activity Spreadsheet -- Enzyme Inhibition Constant Data from BindingDB
Found 4 hits for monomerid = 50096444
Trg + Lig
Ki
nM
ΔG°
kcal/mole
IC50
nM
Kd
nM
EC50/IC50
nM
koff
s-1
kon
M-1s-1
pHTemp
°C
Putative P2Y purinoceptor 10
(Homo sapiens (Human))
BDBM50096444
(CHEMBL3577177)
Show SMILES CCCCCCCOc1ccccc1CCC(=O)OCCCOP(O)(=O)OC[C@H](N)C(O)=O |r|
Show InChI InChI=1S/C22H36NO9P/c1-2-3-4-5-8-14-29-20-11-7-6-10-18(20)12-13-21(24)30-15-9-16-31-33(27,28)32-17-19(23)22(25)26/h6-7,10-11,19H,2-5,8-9,12-17,23H2,1H3,(H,25,26)(H,27,28)/t19-/m0/s1
n/an/an/an/a 85n/an/an/an/a
The University of Tokyo
Curated by ChEMBL
Assay Description
Agonist activity at P2Y10 (unknown origin) transfected in HEK293A cells after 1 hr by TGFalpha shedding assay
J Med Chem 58: 4204-19 (2015)
Article DOI: 10.1021/jm5020082
BindingDB Entry DOI: 10.7270/Q2Q81FTD
Probable G-protein coupled receptor 174
(Homo sapiens (Human))
BDBM50096444
(CHEMBL3577177)
Show SMILES CCCCCCCOc1ccccc1CCC(=O)OCCCOP(O)(=O)OC[C@H](N)C(O)=O |r|
Show InChI InChI=1S/C22H36NO9P/c1-2-3-4-5-8-14-29-20-11-7-6-10-18(20)12-13-21(24)30-15-9-16-31-33(27,28)32-17-19(23)22(25)26/h6-7,10-11,19H,2-5,8-9,12-17,23H2,1H3,(H,25,26)(H,27,28)/t19-/m0/s1
n/an/an/an/a>1.00E+3n/an/an/an/a
The University of Tokyo
Curated by ChEMBL
Assay Description
Agonist activity at GPR174 (unknown origin) transfected in HEK293FT cells after 1 hr by TGFalpha shedding assay
J Med Chem 58: 4204-19 (2015)
Article DOI: 10.1021/jm5020082
BindingDB Entry DOI: 10.7270/Q2Q81FTD
Putative P2Y purinoceptor 10
(Homo sapiens (Human))
BDBM50096444
(CHEMBL3577177)
Show SMILES CCCCCCCOc1ccccc1CCC(=O)OCCCOP(O)(=O)OC[C@H](N)C(O)=O |r|
Show InChI InChI=1S/C22H36NO9P/c1-2-3-4-5-8-14-29-20-11-7-6-10-18(20)12-13-21(24)30-15-9-16-31-33(27,28)32-17-19(23)22(25)26/h6-7,10-11,19H,2-5,8-9,12-17,23H2,1H3,(H,25,26)(H,27,28)/t19-/m0/s1
n/an/an/an/a 86n/an/an/an/a
The University of Tokyo
Curated by ChEMBL
Assay Description
Agonist activity at P2Y10 (unknown origin) transfected in HEK293A cells after 1 hr by TGFalpha shedding assay
J Med Chem 58: 4204-19 (2015)
Article DOI: 10.1021/jm5020082
BindingDB Entry DOI: 10.7270/Q2Q81FTD
Probable G-protein coupled receptor 34
(Homo sapiens (Human))
BDBM50096444
(CHEMBL3577177)
Show SMILES CCCCCCCOc1ccccc1CCC(=O)OCCCOP(O)(=O)OC[C@H](N)C(O)=O |r|
Show InChI InChI=1S/C22H36NO9P/c1-2-3-4-5-8-14-29-20-11-7-6-10-18(20)12-13-21(24)30-15-9-16-31-33(27,28)32-17-19(23)22(25)26/h6-7,10-11,19H,2-5,8-9,12-17,23H2,1H3,(H,25,26)(H,27,28)/t19-/m0/s1
n/an/an/an/a>1.00E+3n/an/an/an/a
The University of Tokyo
Curated by ChEMBL
Assay Description
Agonist activity at GPR34 (unknown origin) transfected in HEK293A cells after 1 hr by TGFalpha shedding assay
J Med Chem 58: 4204-19 (2015)
Article DOI: 10.1021/jm5020082
BindingDB Entry DOI: 10.7270/Q2Q81FTD