BDBM50096598 ((2R,3S,4R,5R)-3-hydroxy-4-(3-methoxybenzamido)-5-(6-(naphthalen-1-ylmethylamino)-9H-purin-9-yl)tetrahydrofuran-2-yl)methyl dihydrogen phosphate::CHEMBL366942::Phosphoric acid mono-((2R,3S,4R,5R)-3-hydroxy-4-(3-methoxy-benzoylamino)-5-{6-[(naphthalen-1-ylmethyl)-amino]-purin-9-yl}-tetrahydro-furan-2-ylmethyl) ester
SMILES: COc1cccc(c1)C(=O)N[C@@H]1[C@H](O)[C@@H](COP(O)(O)=O)O[C@H]1n1cnc2c(NCc3cccc4ccccc34)ncnc12
InChI Key: InChIKey=WCJVICQJLSYOTE-BYHVZLFPSA-N
Data: 5 IC50
Activity Spreadsheet -- Enzyme Inhibition Constant Data from BindingDB
Found 5 hits for monomerid = 50096598
Trg + Lig
Ki
nM
ΔG°
kcal/mole
IC50
nM
Kd
nM
EC50/IC50
nM
koff
s-1
kon
M-1s-1
pHTemp
°C
Glyceraldehyde-3-phosphate dehydrogenase liver
(Homo sapiens (Human))
BDBM50096598
(((2R,3S,4R,5R)-3-hydroxy-4-(3-methoxybenzamido)-5-...)
Show SMILES COc1cccc(c1)C(=O)N[C@@H]1[C@H](O)[C@@H](COP(O)(O)=O)O[C@H]1n1cnc2c(NCc3cccc4ccccc34)ncnc12 |r|
Show InChI InChI=1S/C29H29N6O8P/c1-41-20-10-5-8-18(12-20)28(37)34-23-25(36)22(14-42-44(38,39)40)43-29(23)35-16-33-24-26(31-15-32-27(24)35)30-13-19-9-4-7-17-6-2-3-11-21(17)19/h2-12,15-16,22-23,25,29,36H,13-14H2,1H3,(H,34,37)(H,30,31,32)(H2,38,39,40)/t22-,23-,25-,29-/m1/s1
NCI pathway
Reactome pathway
n/an/a 2.00E+3n/an/an/an/an/an/a
University of Washington
Curated by ChEMBL
Assay Description
Inhibitory concentration against Trypanosoma mexicana glyceraldehyde-3-phosphate dehydrogenase (GAPDH)
Bioorg Med Chem Lett 11: 95-8 (2001)
BindingDB Entry DOI: 10.7270/Q2F76D3N
Glyceraldehyde-3-phosphate dehydrogenase, glycosomal
(Trypanosoma cruzi)
BDBM50096598
(((2R,3S,4R,5R)-3-hydroxy-4-(3-methoxybenzamido)-5-...)
Show SMILES COc1cccc(c1)C(=O)N[C@@H]1[C@H](O)[C@@H](COP(O)(O)=O)O[C@H]1n1cnc2c(NCc3cccc4ccccc34)ncnc12 |r|
Show InChI InChI=1S/C29H29N6O8P/c1-41-20-10-5-8-18(12-20)28(37)34-23-25(36)22(14-42-44(38,39)40)43-29(23)35-16-33-24-26(31-15-32-27(24)35)30-13-19-9-4-7-17-6-2-3-11-21(17)19/h2-12,15-16,22-23,25,29,36H,13-14H2,1H3,(H,34,37)(H,30,31,32)(H2,38,39,40)/t22-,23-,25-,29-/m1/s1
n/an/a 5.00E+3n/an/an/an/an/an/a
Universidade de S£o Paulo
Curated by ChEMBL
Assay Description
Inhibition of Trypanosoma cruzi recombinant glycosomal GAPDH expressed in Escherichia coli by spectrophotometry
Bioorg Med Chem 17: 2476-82 (2009)
Article DOI: 10.1016/j.bmc.2009.01.079
BindingDB Entry DOI: 10.7270/Q2BC40FV
Glyceraldehyde-3-phosphate dehydrogenase liver
(Homo sapiens (Human))
BDBM50096598
(((2R,3S,4R,5R)-3-hydroxy-4-(3-methoxybenzamido)-5-...)
Show SMILES COc1cccc(c1)C(=O)N[C@@H]1[C@H](O)[C@@H](COP(O)(O)=O)O[C@H]1n1cnc2c(NCc3cccc4ccccc34)ncnc12 |r|
Show InChI InChI=1S/C29H29N6O8P/c1-41-20-10-5-8-18(12-20)28(37)34-23-25(36)22(14-42-44(38,39)40)43-29(23)35-16-33-24-26(31-15-32-27(24)35)30-13-19-9-4-7-17-6-2-3-11-21(17)19/h2-12,15-16,22-23,25,29,36H,13-14H2,1H3,(H,34,37)(H,30,31,32)(H2,38,39,40)/t22-,23-,25-,29-/m1/s1
NCI pathway
Reactome pathway
n/an/a>1.00E+5n/an/an/an/an/an/a
University of Washington
Curated by ChEMBL
Assay Description
Inhibitory concentration against rabbit muscle glyceraldehyde-3-phosphate dehydrogenase (GAPDH)
Bioorg Med Chem Lett 11: 95-8 (2001)
BindingDB Entry DOI: 10.7270/Q2F76D3N
Glyceraldehyde-3-phosphate dehydrogenase liver
(Homo sapiens (Human))
BDBM50096598
(((2R,3S,4R,5R)-3-hydroxy-4-(3-methoxybenzamido)-5-...)
Show SMILES COc1cccc(c1)C(=O)N[C@@H]1[C@H](O)[C@@H](COP(O)(O)=O)O[C@H]1n1cnc2c(NCc3cccc4ccccc34)ncnc12 |r|
Show InChI InChI=1S/C29H29N6O8P/c1-41-20-10-5-8-18(12-20)28(37)34-23-25(36)22(14-42-44(38,39)40)43-29(23)35-16-33-24-26(31-15-32-27(24)35)30-13-19-9-4-7-17-6-2-3-11-21(17)19/h2-12,15-16,22-23,25,29,36H,13-14H2,1H3,(H,34,37)(H,30,31,32)(H2,38,39,40)/t22-,23-,25-,29-/m1/s1
NCI pathway
Reactome pathway
n/an/a 7.00E+3n/an/an/an/an/an/a
University of Washington
Curated by ChEMBL
Assay Description
Inhibitory concentration against rabbit muscle glyceraldehyde-3-phosphate dehydrogenase (GAPDH)
Bioorg Med Chem Lett 11: 95-8 (2001)
BindingDB Entry DOI: 10.7270/Q2F76D3N
Glyceraldehyde-3-phosphate dehydrogenase liver
(Homo sapiens (Human))
BDBM50096598
(((2R,3S,4R,5R)-3-hydroxy-4-(3-methoxybenzamido)-5-...)
Show SMILES COc1cccc(c1)C(=O)N[C@@H]1[C@H](O)[C@@H](COP(O)(O)=O)O[C@H]1n1cnc2c(NCc3cccc4ccccc34)ncnc12 |r|
Show InChI InChI=1S/C29H29N6O8P/c1-41-20-10-5-8-18(12-20)28(37)34-23-25(36)22(14-42-44(38,39)40)43-29(23)35-16-33-24-26(31-15-32-27(24)35)30-13-19-9-4-7-17-6-2-3-11-21(17)19/h2-12,15-16,22-23,25,29,36H,13-14H2,1H3,(H,34,37)(H,30,31,32)(H2,38,39,40)/t22-,23-,25-,29-/m1/s1
NCI pathway
Reactome pathway
n/an/a 5.00E+3n/an/an/an/an/an/a
University of Washington
Curated by ChEMBL
Assay Description
Inhibitory concentration against Trypanosoma mexicana glyceraldehyde-3-phosphate dehydrogenase (GAPDH)
Bioorg Med Chem Lett 11: 95-8 (2001)
BindingDB Entry DOI: 10.7270/Q2F76D3N