BDBM50096599 CHEMBL3577160
SMILES: CCCCCCCC\C=C/CCCCCCCC(=O)OC[C@@H](O)COP(O)(=O)OC[C@@H](N)C(O)=O
InChI Key: InChIKey=JZWNYZVVZXZRRH-LUCICDSHSA-N
Data: 1 EC50
PDB links: 41 PDB IDs match this monomer.
Activity Spreadsheet -- Enzyme Inhibition Constant Data from BindingDB
Found 1 hit for monomerid = 50096599
Trg + Lig
Ki
nM
ΔG°
kcal/mole
IC50
nM
Kd
nM
EC50/IC50
nM
koff
s-1
kon
M-1s-1
pHTemp
°C
Putative P2Y purinoceptor 10
(Homo sapiens (Human))
BDBM50096599
(CHEMBL3577160)
Show SMILES CCCCCCCC\C=C/CCCCCCCC(=O)OC[C@@H](O)COP(O)(=O)OC[C@@H](N)C(O)=O |r|
Show InChI InChI=1S/C24H46NO9P/c1-2-3-4-5-6-7-8-9-10-11-12-13-14-15-16-17-23(27)32-18-21(26)19-33-35(30,31)34-20-22(25)24(28)29/h9-10,21-22,26H,2-8,11-20,25H2,1H3,(H,28,29)(H,30,31)/b10-9-/t21-,22-/m1/s1
n/an/an/an/a>1.00E+3n/an/an/an/a
The University of Tokyo
Curated by ChEMBL
Assay Description
Agonist activity at P2Y10 (unknown origin) transfected in HEK293A cells after 1 hr by TGFalpha shedding assay
J Med Chem 58: 4204-19 (2015)
Article DOI: 10.1021/jm5020082
BindingDB Entry DOI: 10.7270/Q2Q81FTD