BDBM50096614 CHEMBL3577282
SMILES: CC(C)(C)OC(=O)N1CCC(CNC(=O)Cn2c3C[C@@H](CCc3c3cc(Br)ccc23)C(O)=O)CC1
InChI Key: InChIKey=CKQXDENSBJJQHO-QGZVFWFLSA-N
Data: 1 KI  1 IC50
Activity Spreadsheet -- Enzyme Inhibition Constant Data from BindingDB
Found 2 hits for monomerid = 50096614
Trg + Lig
Ki
nM
ΔG°
kcal/mole
IC50
nM
Kd
nM
EC50/IC50
nM
koff
s-1
kon
M-1s-1
pHTemp
°C
DNA polymerase III subunit beta
(Escherichia coli (strain K12))
BDBM50096614
(CHEMBL3577282)
Show SMILES CC(C)(C)OC(=O)N1CCC(CNC(=O)Cn2c3C[C@@H](CCc3c3cc(Br)ccc23)C(O)=O)CC1 |r|
Show InChI InChI=1S/C26H34BrN3O5/c1-26(2,3)35-25(34)29-10-8-16(9-11-29)14-28-23(31)15-30-21-7-5-18(27)13-20(21)19-6-4-17(24(32)33)12-22(19)30/h5,7,13,16-17H,4,6,8-12,14-15H2,1-3H3,(H,28,31)(H,32,33)/t17-/m1/s1
8.30E+4n/an/an/an/an/an/an/an/a
The University of Wollongong and The Illawarra Health and Medical Research Institute
Curated by ChEMBL
Assay Description
Inhibition of Escherichia coli DNA sliding clamp protein using N-fluorescein (FAM)-QLDLF-OH tracer by fluorescence polarization assay
J Med Chem 58: 4693-702 (2015)
Article DOI: 10.1021/acs.jmedchem.5b00232
BindingDB Entry DOI: 10.7270/Q2KK9DJ9
DNA polymerase III subunit beta
(Escherichia coli (strain K12))
BDBM50096614
(CHEMBL3577282)
Show SMILES CC(C)(C)OC(=O)N1CCC(CNC(=O)Cn2c3C[C@@H](CCc3c3cc(Br)ccc23)C(O)=O)CC1 |r|
Show InChI InChI=1S/C26H34BrN3O5/c1-26(2,3)35-25(34)29-10-8-16(9-11-29)14-28-23(31)15-30-21-7-5-18(27)13-20(21)19-6-4-17(24(32)33)12-22(19)30/h5,7,13,16-17H,4,6,8-12,14-15H2,1-3H3,(H,28,31)(H,32,33)/t17-/m1/s1
n/an/a 1.50E+5n/an/an/an/an/an/a
The University of Wollongong and The Illawarra Health and Medical Research Institute
Curated by ChEMBL
Assay Description
Inhibition of Escherichia coli DNA sliding clamp protein using N-fluorescein (FAM)-QLDLF-OH tracer by fluorescence polarization assay
J Med Chem 58: 4693-702 (2015)
Article DOI: 10.1021/acs.jmedchem.5b00232
BindingDB Entry DOI: 10.7270/Q2KK9DJ9