null
SMILES: OC(=O)C1CCc2c(C1)[nH]c1ccc(Cl)cc21
InChI Key:
PDB links: 1 PDB ID matches this monomer.
Activity Spreadsheet -- Enzyme Inhibition Constant Data from BindingDB
Found 2 hits for monomerid = 50096641
Trg + Lig
Ki
nM
ΔG°
kcal/mole
IC50
nM
Kd
nM
EC50/IC50
nM
koff
s-1
kon
M-1s-1
pHTemp
°C
Beta sliding clamp
(Escherichia coli (strain K12))
BDBM50096641
(CHEMBL3277053)
Show SMILES OC(=O)C1CCc2c(C1)[nH]c1ccc(Cl)cc21
1.66E+5n/an/an/an/an/an/an/an/a
The University of Wollongong and The Illawarra Health and Medical Research Institute
Curated by ChEMBL
Assay Description
Inhibition of Escherichia coli DNA sliding clamp protein using N-fluorescein (FAM)-QLDLF-OH tracer by fluorescence polarization assay
J Med Chem 58: 4693-702 (2015)
Article DOI: 10.1021/acs.jmedchem.5b00232
BindingDB Entry DOI: 10.7270/Q2KK9DJ9
3D
3D Structure (crystal)
Beta sliding clamp
(Escherichia coli (strain K12))
BDBM50096641
(CHEMBL3277053)
Show SMILES OC(=O)C1CCc2c(C1)[nH]c1ccc(Cl)cc21
n/an/a 2.99E+5n/an/an/an/an/an/a
The University of Wollongong and The Illawarra Health and Medical Research Institute
Curated by ChEMBL
Assay Description
Inhibition of Escherichia coli DNA sliding clamp protein using N-fluorescein (FAM)-QLDLF-OH tracer by fluorescence polarization assay
J Med Chem 58: 4693-702 (2015)
Article DOI: 10.1021/acs.jmedchem.5b00232
BindingDB Entry DOI: 10.7270/Q2KK9DJ9
3D
3D Structure (crystal)