null
SMILES: CCc1cc(c(=O)[nH]c1C)C(OCc1c(F)cccc1F)(C#CC1CC1)C(F)(F)F
InChI Key: InChIKey=LXMKHFOOUFIQNM-UHFFFAOYSA-N
Activity Spreadsheet -- Enzyme Inhibition Constant Data from BindingDB
Found 1 hit for monomerid = 50096670
Trg + Lig
Ki
nM
ΔG°
kcal/mole
IC50
nM
Kd
nM
EC50/IC50
nM
koff
s-1
kon
M-1s-1
pHTemp
°C
Reverse transcriptase/RNaseH
(Human immunodeficiency virus 1)
BDBM50096670
(3-[3-Cyclopropyl-1-(2,6-difluoro-benzyloxy)-1-trif...)
Show SMILES CCc1cc(c(=O)[nH]c1C)C(OCc1c(F)cccc1F)(C#CC1CC1)C(F)(F)F
Show InChI InChI=1S/C22H20F5NO2/c1-3-15-11-17(20(29)28-13(15)2)21(22(25,26)27,10-9-14-7-8-14)30-12-16-18(23)5-4-6-19(16)24/h4-6,11,14H,3,7-8,12H2,1-2H3,(H,28,29)
n/an/a 613n/an/an/an/an/an/a
DuPont Pharmaceuticals Company
Curated by ChEMBL
Assay Description
Inhibition of the NNRTI HIV-1 enzyme by 50% using enzyme assay.
Bioorg Med Chem Lett 11: 309-12 (2001)
BindingDB Entry DOI: 10.7270/Q23T9HSR