null
SMILES: FC(F)(F)C(OCc1ccncc1)(C#CC1CC1)c1ccc[nH]c1=O
InChI Key: InChIKey=INJQBPWBVJPBDU-UHFFFAOYSA-N
Activity Spreadsheet -- Enzyme Inhibition Constant Data from BindingDB
Found 1 hit for monomerid = 50096671
Trg + Lig
Ki
nM
ΔG°
kcal/mole
IC50
nM
Kd
nM
EC50/IC50
nM
koff
s-1
kon
M-1s-1
pHTemp
°C
Reverse transcriptase/RNaseH
(Human immunodeficiency virus 1)
BDBM50096671
(3-[3-Cyclopropyl-1-(pyridin-4-ylmethoxy)-1-trifluo...)
Show SMILES FC(F)(F)C(OCc1ccncc1)(C#CC1CC1)c1ccc[nH]c1=O
Show InChI InChI=1S/C18H15F3N2O2/c19-18(20,21)17(8-5-13-3-4-13,15-2-1-9-23-16(15)24)25-12-14-6-10-22-11-7-14/h1-2,6-7,9-11,13H,3-4,12H2,(H,23,24)
n/an/a 8.12E+3n/an/an/an/an/an/a
DuPont Pharmaceuticals Company
Curated by ChEMBL
Assay Description
Inhibition of the NNRTI HIV-1 enzyme by 50% using enzyme assay.
Bioorg Med Chem Lett 11: 309-12 (2001)
BindingDB Entry DOI: 10.7270/Q23T9HSR