BDBM50096969 CHEMBL3580924
SMILES: CCn1c(Cc2c[nH]c3ccc(OC)cc23)n[nH]c1=S
InChI Key: InChIKey=CDVYKIKHQZXGIL-UHFFFAOYSA-N
Data: 2 KI  1 EC50
Activity Spreadsheet -- Enzyme Inhibition Constant Data from BindingDB
Found 3 hits for monomerid = 50096969
Trg + Lig
Ki
nM
ΔG°
kcal/mole
IC50
nM
Kd
nM
EC50/IC50
nM
koff
s-1
kon
M-1s-1
pHTemp
°C
Melatonin receptor
(Homo sapiens (Human))
BDBM50096969
(CHEMBL3580924)
Show SMILES CCn1c(Cc2c[nH]c3ccc(OC)cc23)n[nH]c1=S
Show InChI InChI=1S/C14H16N4OS/c1-3-18-13(16-17-14(18)20)6-9-8-15-12-5-4-10(19-2)7-11(9)12/h4-5,7-8,15H,3,6H2,1-2H3,(H,17,20)
Reactome pathway
220n/an/an/an/an/an/an/an/a
IQM-CSIC
Curated by ChEMBL
Assay Description
Displacement of 2-[125I]-iodomelatonin from human melatonin receptor-2 transfected in CHO cell membranes after 120 mins
J Med Chem 58: 4998-5014 (2015)
Article DOI: 10.1021/acs.jmedchem.5b00245
BindingDB Entry DOI: 10.7270/Q2JM2CDG
Melatonin receptor
(Homo sapiens (Human))
BDBM50096969
(CHEMBL3580924)
Show SMILES CCn1c(Cc2c[nH]c3ccc(OC)cc23)n[nH]c1=S
Show InChI InChI=1S/C14H16N4OS/c1-3-18-13(16-17-14(18)20)6-9-8-15-12-5-4-10(19-2)7-11(9)12/h4-5,7-8,15H,3,6H2,1-2H3,(H,17,20)
Reactome pathway
>1.00E+3n/an/an/an/an/an/an/an/a
IQM-CSIC
Curated by ChEMBL
Assay Description
Displacement of 2-[125I]-iodomelatonin from human melatonin receptor-1 transfected in CHO cell membranes after 120 mins
J Med Chem 58: 4998-5014 (2015)
Article DOI: 10.1021/acs.jmedchem.5b00245
BindingDB Entry DOI: 10.7270/Q2JM2CDG
Melatonin receptor
(Homo sapiens (Human))
BDBM50096969
(CHEMBL3580924)
Show SMILES CCn1c(Cc2c[nH]c3ccc(OC)cc23)n[nH]c1=S
Show InChI InChI=1S/C14H16N4OS/c1-3-18-13(16-17-14(18)20)6-9-8-15-12-5-4-10(19-2)7-11(9)12/h4-5,7-8,15H,3,6H2,1-2H3,(H,17,20)
Reactome pathway
n/an/an/an/a>1.00E+3n/an/an/an/a
IQM-CSIC
Curated by ChEMBL
Assay Description
Agonist activity at human melatonin receptor-2 transfected in CHO cell membranes after 1 hr by GTPgammaS binding assay
J Med Chem 58: 4998-5014 (2015)
Article DOI: 10.1021/acs.jmedchem.5b00245
BindingDB Entry DOI: 10.7270/Q2JM2CDG