BDBM50097091 2-(4-Bromo-phenyl)-5,7-dichloro-quinoline-4-carboxylic acid::CHEMBL358675
SMILES: OC(=O)c1cc(nc2cc(Cl)cc(Cl)c12)-c1ccc(Br)cc1
InChI Key: InChIKey=HQKJAPNOOSHIBL-UHFFFAOYSA-N
Data: 2 IC50
Activity Spreadsheet -- Enzyme Inhibition Constant Data from BindingDB
Found 2 hits for monomerid = 50097091
Trg + Lig
Ki
nM
ΔG°
kcal/mole
IC50
nM
Kd
nM
EC50/IC50
nM
koff
s-1
kon
M-1s-1
pHTemp
°C
Aminoacyl-tRNA synthetase
(Homo sapiens (Human))
BDBM50097091
(2-(4-Bromo-phenyl)-5,7-dichloro-quinoline-4-carbox...)
Show SMILES OC(=O)c1cc(nc2cc(Cl)cc(Cl)c12)-c1ccc(Br)cc1
Show InChI InChI=1S/C16H8BrCl2NO2/c17-9-3-1-8(2-4-9)13-7-11(16(21)22)15-12(19)5-10(18)6-14(15)20-13/h1-7H,(H,21,22)
Reactome pathway
n/an/a>1.00E+5n/an/an/an/an/an/a
Cubist Pharmaceuticals, Inc.
Curated by ChEMBL
Assay Description
Aminoacylation activity against human prolyl-tRNA synthetase
Bioorg Med Chem Lett 11: 541-4 (2001)
BindingDB Entry DOI: 10.7270/Q2Q23ZH8
Prolyl-tRNA synthetase
(Candida albicans)
BDBM50097091
(2-(4-Bromo-phenyl)-5,7-dichloro-quinoline-4-carbox...)
Show SMILES OC(=O)c1cc(nc2cc(Cl)cc(Cl)c12)-c1ccc(Br)cc1
Show InChI InChI=1S/C16H8BrCl2NO2/c17-9-3-1-8(2-4-9)13-7-11(16(21)22)15-12(19)5-10(18)6-14(15)20-13/h1-7H,(H,21,22)
n/an/a 140n/an/an/an/an/an/a
Cubist Pharmaceuticals, Inc.
Curated by ChEMBL
Assay Description
Aminoacylation activity against Candida albicans prolyl-tRNA synthetase
Bioorg Med Chem Lett 11: 541-4 (2001)
BindingDB Entry DOI: 10.7270/Q2Q23ZH8