BDBM50097108 2-(4-Bromo-phenyl)-6-chloro-8-methyl-quinoline-4-carboxylic acid biphenyl-4-ylmethyl ester::CHEMBL153564
SMILES: Cc1cc(Cl)cc2c(cc(nc12)-c1ccc(Br)cc1)C(=O)OCc1ccc(cc1)-c1ccccc1
InChI Key: InChIKey=NJLFIHLPSYNLGF-UHFFFAOYSA-N
Data: 2 IC50
Activity Spreadsheet -- Enzyme Inhibition Constant Data from BindingDB
Found 2 hits for monomerid = 50097108
Trg + Lig
Ki
nM
ΔG°
kcal/mole
IC50
nM
Kd
nM
EC50/IC50
nM
koff
s-1
kon
M-1s-1
pHTemp
°C
Prolyl-tRNA synthetase
(Candida albicans)
BDBM50097108
(2-(4-Bromo-phenyl)-6-chloro-8-methyl-quinoline-4-c...)
Show SMILES Cc1cc(Cl)cc2c(cc(nc12)-c1ccc(Br)cc1)C(=O)OCc1ccc(cc1)-c1ccccc1
Show InChI InChI=1S/C30H21BrClNO2/c1-19-15-25(32)16-26-27(17-28(33-29(19)26)23-11-13-24(31)14-12-23)30(34)35-18-20-7-9-22(10-8-20)21-5-3-2-4-6-21/h2-17H,18H2,1H3
n/an/a 8.80E+3n/an/an/an/an/an/a
Cubist Pharmaceuticals, Inc.
Curated by ChEMBL
Assay Description
Aminoacylation activity against Candida albicans prolyl-tRNA synthetase
Bioorg Med Chem Lett 11: 541-4 (2001)
BindingDB Entry DOI: 10.7270/Q2Q23ZH8
Aminoacyl-tRNA synthetase
(Homo sapiens (Human))
BDBM50097108
(2-(4-Bromo-phenyl)-6-chloro-8-methyl-quinoline-4-c...)
Show SMILES Cc1cc(Cl)cc2c(cc(nc12)-c1ccc(Br)cc1)C(=O)OCc1ccc(cc1)-c1ccccc1
Show InChI InChI=1S/C30H21BrClNO2/c1-19-15-25(32)16-26-27(17-28(33-29(19)26)23-11-13-24(31)14-12-23)30(34)35-18-20-7-9-22(10-8-20)21-5-3-2-4-6-21/h2-17H,18H2,1H3
Reactome pathway
n/an/a>1.00E+5n/an/an/an/an/an/a
Cubist Pharmaceuticals, Inc.
Curated by ChEMBL
Assay Description
Aminoacylation activity against human prolyl-tRNA synthetase
Bioorg Med Chem Lett 11: 541-4 (2001)
BindingDB Entry DOI: 10.7270/Q2Q23ZH8