BDBM50097155 CHEMBL3581132
SMILES: COc1cccc(CC(=O)Nc2cc(cs2)-c2ccncc2)c1
InChI Key: InChIKey=PRIKHRTWFXDNDC-UHFFFAOYSA-N
Data: 2 KI  1 IC50
Activity Spreadsheet -- Enzyme Inhibition Constant Data from BindingDB
Found 3 hits for monomerid = 50097155
Trg + Lig
Ki
nM
ΔG°
kcal/mole
IC50
nM
Kd
nM
EC50/IC50
nM
koff
s-1
kon
M-1s-1
pHTemp
°C
Rho-associated protein kinase 1
(Homo sapiens (Human))
BDBM50097155
(CHEMBL3581132)
Show SMILES COc1cccc(CC(=O)Nc2cc(cs2)-c2ccncc2)c1
Show InChI InChI=1S/C18H16N2O2S/c1-22-16-4-2-3-13(9-16)10-17(21)20-18-11-15(12-23-18)14-5-7-19-8-6-14/h2-9,11-12H,10H2,1H3,(H,20,21)
NCI pathway
Reactome pathway
10n/an/an/an/an/an/an/an/a
Vertex Pharmaceuticals, Inc.
Curated by ChEMBL
Assay Description
Inhibition of ROCK1 (6 to 553 amino acids) (unknown origin) using Lys-Lys-Arg-Asn-Arg-Thr-Leu-Ser-Val as substrate preincubated for 15 mins followed ...
J Med Chem 58: 5028-37 (2015)
Article DOI: 10.1021/acs.jmedchem.5b00424
BindingDB Entry DOI: 10.7270/Q2930VXW
cAMP-dependent protein kinase (PKA)
(Homo sapiens (Human))
BDBM50097155
(CHEMBL3581132)
Show SMILES COc1cccc(CC(=O)Nc2cc(cs2)-c2ccncc2)c1
Show InChI InChI=1S/C18H16N2O2S/c1-22-16-4-2-3-13(9-16)10-17(21)20-18-11-15(12-23-18)14-5-7-19-8-6-14/h2-9,11-12H,10H2,1H3,(H,20,21)
NCI pathway
Reactome pathway
600n/an/an/an/an/an/an/an/a
Vertex Pharmaceuticals, Inc.
Curated by ChEMBL
Assay Description
Inhibition of PKAalpha (1 to 351 amino acids) (unknown origin) using Leu-Arg-Arg-Ala-Ser-Leu-Gly as substrate by pyruvate kinase/lactate dehydrogenas...
J Med Chem 58: 5028-37 (2015)
Article DOI: 10.1021/acs.jmedchem.5b00424
BindingDB Entry DOI: 10.7270/Q2930VXW
Cytochrome P450 3A4
(Homo sapiens (Human))
BDBM50097155
(CHEMBL3581132)
Show SMILES COc1cccc(CC(=O)Nc2cc(cs2)-c2ccncc2)c1
Show InChI InChI=1S/C18H16N2O2S/c1-22-16-4-2-3-13(9-16)10-17(21)20-18-11-15(12-23-18)14-5-7-19-8-6-14/h2-9,11-12H,10H2,1H3,(H,20,21)
Reactome pathway
n/an/a 480n/an/an/an/an/an/a
Vertex Pharmaceuticals, Inc.
Curated by ChEMBL
Assay Description
Inhibition of CYP3A4 (unknown origin)
J Med Chem 58: 5028-37 (2015)
Article DOI: 10.1021/acs.jmedchem.5b00424
BindingDB Entry DOI: 10.7270/Q2930VXW