BDBM50097327 CHEMBL345715::Phosphoric acid 12-(2-{1-[2-(5-chloro-indol-1-yl)-ethyl]-1H-indol-3-yl}-acetylamino)-dodecyl ester cyclohexyl ester; compound with triethyl-amine
SMILES: OP(=O)(OCCCCCCCCCCCCNC(=O)Cc1cn(CCn2ccc3cc(Cl)ccc23)c2ccccc12)OC1CCCCC1
InChI Key: InChIKey=QFBPBSCKTKUNKD-UHFFFAOYSA-N
Data: 2 IC50
Activity Spreadsheet -- Enzyme Inhibition Constant Data from BindingDB
Found 2 hits for monomerid = 50097327
Trg + Lig
Ki
nM
ΔG°
kcal/mole
IC50
nM
Kd
nM
EC50/IC50
nM
koff
s-1
kon
M-1s-1
pHTemp
°C
Telomerase reverse transcriptase
(Homo sapiens (Human))
BDBM50097327
(CHEMBL345715 | Phosphoric acid 12-(2-{1-[2-(5-chlo...)
Show SMILES OP(=O)(OCCCCCCCCCCCCNC(=O)Cc1cn(CCn2ccc3cc(Cl)ccc23)c2ccccc12)OC1CCCCC1
Show InChI InChI=1S/C38H53ClN3O5P/c39-33-20-21-36-31(28-33)22-24-41(36)25-26-42-30-32(35-18-12-13-19-37(35)42)29-38(43)40-23-14-7-5-3-1-2-4-6-8-15-27-46-48(44,45)47-34-16-10-9-11-17-34/h12-13,18-22,24,28,30,34H,1-11,14-17,23,25-27,29H2,(H,40,43)(H,44,45)
NCI pathway
Reactome pathway
n/an/a 1.01E+5n/an/an/an/an/an/a
Kyushu University
Curated by ChEMBL
Assay Description
Inhibition of human geranylgeranyltransferase-I
Bioorg Med Chem Lett 11: 583-5 (2001)
BindingDB Entry DOI: 10.7270/Q2XK8DV2
Telomerase reverse transcriptase
(Homo sapiens (Human))
BDBM50097327
(CHEMBL345715 | Phosphoric acid 12-(2-{1-[2-(5-chlo...)
Show SMILES OP(=O)(OCCCCCCCCCCCCNC(=O)Cc1cn(CCn2ccc3cc(Cl)ccc23)c2ccccc12)OC1CCCCC1
Show InChI InChI=1S/C38H53ClN3O5P/c39-33-20-21-36-31(28-33)22-24-41(36)25-26-42-30-32(35-18-12-13-19-37(35)42)29-38(43)40-23-14-7-5-3-1-2-4-6-8-15-27-46-48(44,45)47-34-16-10-9-11-17-34/h12-13,18-22,24,28,30,34H,1-11,14-17,23,25-27,29H2,(H,40,43)(H,44,45)
NCI pathway
Reactome pathway
n/an/a 8.70E+3n/an/an/an/an/an/a
Kyushu University
Curated by ChEMBL
Assay Description
Inhibitory concentration against human telomerase
Bioorg Med Chem Lett 11: 583-5 (2001)
BindingDB Entry DOI: 10.7270/Q2XK8DV2