BDBM50097430 CHEMBL164087::N-(4-Pyridin-2-yl-thiazol-2-yl)-benzamide
SMILES: O=C(Nc1nc(cs1)-c1ccccn1)c1ccccc1
InChI Key: InChIKey=NNBHDRDMPNNEKO-UHFFFAOYSA-N
Data: 3 KI  3 IC50
Activity Spreadsheet -- Enzyme Inhibition Constant Data from BindingDB
Found 6 hits for monomerid = 50097430
Trg + Lig
Ki
nM
ΔG°
kcal/mole
IC50
nM
Kd
nM
EC50/IC50
nM
koff
s-1
kon
M-1s-1
pHTemp
°C
Adenosine receptor A1
(Rattus norvegicus (rat))
BDBM50097430
(CHEMBL164087 | N-(4-Pyridin-2-yl-thiazol-2-yl)-ben...)
Show SMILES O=C(Nc1nc(cs1)-c1ccccn1)c1ccccc1
Show InChI InChI=1S/C15H11N3OS/c19-14(11-6-2-1-3-7-11)18-15-17-13(10-20-15)12-8-4-5-9-16-12/h1-10H,(H,17,18,19)
Reactome pathway
1.70E+3n/an/an/an/an/an/an/an/a
Vrije Universiteit
Curated by ChEMBL
Assay Description
Displacement of [3H]DPCPX binding to adenosine A1 receptor of rat brain cortical membrane
J Med Chem 44: 749-62 (2001)
BindingDB Entry DOI: 10.7270/Q2H132Q0
Adenosine receptor A3
(Homo sapiens (Human))
BDBM50097430
(CHEMBL164087 | N-(4-Pyridin-2-yl-thiazol-2-yl)-ben...)
Show SMILES O=C(Nc1nc(cs1)-c1ccccn1)c1ccccc1
Show InChI InChI=1S/C15H11N3OS/c19-14(11-6-2-1-3-7-11)18-15-17-13(10-20-15)12-8-4-5-9-16-12/h1-10H,(H,17,18,19)
Reactome pathway
3.40E+3n/an/an/an/an/an/an/an/a
Vrije Universiteit
Curated by ChEMBL
Assay Description
Displacement of [125I]AB-MECA from human adenosine A3 receptor expressed in HEK 293 cells
J Med Chem 44: 749-62 (2001)
BindingDB Entry DOI: 10.7270/Q2H132Q0
Adenosine Receptors A2a (A2a)
(Rattus norvegicus (rat))
BDBM50097430
(CHEMBL164087 | N-(4-Pyridin-2-yl-thiazol-2-yl)-ben...)
Show SMILES O=C(Nc1nc(cs1)-c1ccccn1)c1ccccc1
Show InChI InChI=1S/C15H11N3OS/c19-14(11-6-2-1-3-7-11)18-15-17-13(10-20-15)12-8-4-5-9-16-12/h1-10H,(H,17,18,19)
Reactome pathway
8.70E+3n/an/an/an/an/an/an/an/a
Vrije Universiteit
Curated by ChEMBL
Assay Description
Displacement of [3H]-CGS-21,680 or [3H]ZM-241385 binding in adenosine A2A receptor of rat striatal membrane was determined
J Med Chem 44: 749-62 (2001)
BindingDB Entry DOI: 10.7270/Q2H132Q0
Lysine-specific demethylase 5B
(Homo sapiens (Human))
BDBM50097430
(CHEMBL164087 | N-(4-Pyridin-2-yl-thiazol-2-yl)-ben...)
Show SMILES O=C(Nc1nc(cs1)-c1ccccn1)c1ccccc1
Show InChI InChI=1S/C15H11N3OS/c19-14(11-6-2-1-3-7-11)18-15-17-13(10-20-15)12-8-4-5-9-16-12/h1-10H,(H,17,18,19)
n/an/a 5.12E+4n/an/an/an/an/an/a
The Institute of Cancer Research
Curated by ChEMBL
Assay Description
Inhibition of KDM5B (unknown origin) using biotin-H3K4me3 as substrate preincubated for 15 mins followed by substrate addition measured after 20 mins...
J Med Chem 59: 1388-409 (2016)
BindingDB Entry DOI: 10.7270/Q2W097TR
Lysine-specific demethylase 4A
(Homo sapiens (Human))
BDBM50097430
(CHEMBL164087 | N-(4-Pyridin-2-yl-thiazol-2-yl)-ben...)
Show SMILES O=C(Nc1nc(cs1)-c1ccccn1)c1ccccc1
Show InChI InChI=1S/C15H11N3OS/c19-14(11-6-2-1-3-7-11)18-15-17-13(10-20-15)12-8-4-5-9-16-12/h1-10H,(H,17,18,19)
n/an/a 2.09E+4n/an/an/an/an/an/a
The Institute of Cancer Research
Curated by ChEMBL
Assay Description
Inhibition of human N-terminal His-tagged KDM4A (1 to 359 residues) expressed in Escherichia coli using biotin-H3K9me3 as substrate preincubated for ...
J Med Chem 59: 1388-409 (2016)
BindingDB Entry DOI: 10.7270/Q2W097TR
Lysine-specific demethylase 4B
(Homo sapiens (Human))
BDBM50097430
(CHEMBL164087 | N-(4-Pyridin-2-yl-thiazol-2-yl)-ben...)
Show SMILES O=C(Nc1nc(cs1)-c1ccccn1)c1ccccc1
Show InChI InChI=1S/C15H11N3OS/c19-14(11-6-2-1-3-7-11)18-15-17-13(10-20-15)12-8-4-5-9-16-12/h1-10H,(H,17,18,19)
n/an/a 1.21E+4n/an/an/an/an/an/a
The Institute of Cancer Research
Curated by ChEMBL
Assay Description
Inhibition of recombinant human N-terminal GST-tagged KDM4B (1 to 500 residues) expressed in baculovirus infected sf9 cells using biotin-H3K9me3 as s...
J Med Chem 59: 1388-409 (2016)
BindingDB Entry DOI: 10.7270/Q2W097TR