BDBM50097529 CHEMBL354215::[17-(1,5-Dimethyl-hexyl)-10,13-dimethyl-hexadecahydro-cyclopenta[a]phenanthren-3-yloxythiocarbonylsulfanyl]-acetic acid
SMILES: CC(C)CCC[C@@H](C)[C@H]1CC[C@H]2[C@@H]3CC[C@H]4C[C@H](CC[C@]4(C)[C@H]3CC[C@]12C)OC(=S)SCC(O)=O
InChI Key: InChIKey=ICRFAHPLBWEPSD-GGYQXMIJSA-N
Data: 1 IC50
Activity Spreadsheet -- Enzyme Inhibition Constant Data from BindingDB
Found 1 hit for monomerid = 50097529
Trg + Lig
Ki
nM
ΔG°
kcal/mole
IC50
nM
Kd
nM
EC50/IC50
nM
koff
s-1
kon
M-1s-1
pHTemp
°C
phosphatase Cdc25
(Homo sapiens (Human))
BDBM50097529
(CHEMBL354215 | [17-(1,5-Dimethyl-hexyl)-10,13-dime...)
Show SMILES CC(C)CCC[C@@H](C)[C@H]1CC[C@H]2[C@@H]3CC[C@H]4C[C@H](CC[C@]4(C)[C@H]3CC[C@]12C)OC(=S)SCC(O)=O
Show InChI InChI=1S/C30H50O3S2/c1-19(2)7-6-8-20(3)24-11-12-25-23-10-9-21-17-22(33-28(34)35-18-27(31)32)13-15-29(21,4)26(23)14-16-30(24,25)5/h19-26H,6-18H2,1-5H3,(H,31,32)/t20-,21+,22+,23+,24-,25+,26+,29+,30-/m1/s1
Reactome pathway
n/an/a 900n/an/an/an/an/an/a
School of Chemistry and Biochemistry
Curated by ChEMBL
Assay Description
Inhibitory activity tested against cell division cycle 25A (assay using fluorescein diphosphate (FDP) as substrate)
J Med Chem 44: 834-48 (2001)
BindingDB Entry DOI: 10.7270/Q2C82B14