BDBM50097560 CHEMBL3590072
SMILES: COc1ccc(NC(=O)N[C@H](Cc2c[nH]c3ccccc23)C(=O)NCC2(CCCCC2)c2cccnc2)cc1
InChI Key: InChIKey=KHGGWSPNLCRCHY-UHFFFAOYSA-N
Data: 1 EC50
Activity Spreadsheet -- Enzyme Inhibition Constant Data from BindingDB
Found 1 hit for monomerid = 50097560
Trg + Lig
Ki
nM
ΔG°
kcal/mole
IC50
nM
Kd
nM
EC50/IC50
nM
koff
s-1
kon
M-1s-1
pHTemp
°C
Formyl peptide receptor-related sequence 1
(Mus musculus)
BDBM50097560
(CHEMBL3590072)
Show SMILES COc1ccc(NC(=O)N[C@H](Cc2c[nH]c3ccccc23)C(=O)NCC2(CCCCC2)c2cccnc2)cc1 |r|
Show InChI InChI=1S/C22H16F3N3O2/c1-27-19-18(20(29)28(21(27)30)13-14-6-3-2-4-7-14)17(10-11-26-19)15-8-5-9-16(12-15)22(23,24)25/h2-12H,13H2,1H3
n/an/an/an/a 2.10E+3n/an/an/an/a
Universit£ degli Studi di Bari 'Aldo Moro'
Curated by ChEMBL
Assay Description
Agonist activity at FPR2 in BALB/c mouse assessed as stimulation of Ca2+ influx measured every 5 secs for 240 secs by FLIPR assay
Bioorg Med Chem 23: 3913-24 (2015)
Article DOI: 10.1016/j.bmc.2014.12.007
BindingDB Entry DOI: 10.7270/Q2MS3VHB