null
SMILES: CC(C)N(CCNC(=O)c1ccc2CN(CCc2c1)S(=O)(=O)c1ccc(C)cc1)Cc1ccc(Cl)cc1
InChI Key: InChIKey=WOOJNWRKEYERQH-UHFFFAOYSA-N
Activity Spreadsheet -- Enzyme Inhibition Constant Data from BindingDB
Found 3 hits for monomerid = 50097696
Trg + Lig
Ki
nM
ΔG°
kcal/mole
IC50
nM
Kd
nM
EC50/IC50
nM
koff
s-1
kon
M-1s-1
pHTemp
°C
Kappa-type opioid receptor
(Homo sapiens (Human))
BDBM50097696
(CHEMBL3590192)
Show SMILES CC(C)N(CCNC(=O)c1ccc2CN(CCc2c1)S(=O)(=O)c1ccc(C)cc1)Cc1ccc(Cl)cc1
Show InChI InChI=1S/C29H34ClN3O3S/c1-21(2)32(19-23-6-10-27(30)11-7-23)17-15-31-29(34)25-8-9-26-20-33(16-14-24(26)18-25)37(35,36)28-12-4-22(3)5-13-28/h4-13,18,21H,14-17,19-20H2,1-3H3,(H,31,34)
Reactome pathway
n/an/a 10n/an/an/an/an/an/a
University of Kansas Specialized Chemistry Center
Curated by ChEMBL
Assay Description
Antagonist activity against HA-tagged human recombinant kappa opioid receptor expressed in CHO cell membranes incubated for 1 hr by [35S]GTPgammaS bi...
Bioorg Med Chem 23: 3948-56 (2015)
Article DOI: 10.1016/j.bmc.2014.12.033
BindingDB Entry DOI: 10.7270/Q2R49SJX
Kappa-type opioid receptor
(Homo sapiens (Human))
BDBM50097696
(CHEMBL3590192)
Show SMILES CC(C)N(CCNC(=O)c1ccc2CN(CCc2c1)S(=O)(=O)c1ccc(C)cc1)Cc1ccc(Cl)cc1
Show InChI InChI=1S/C29H34ClN3O3S/c1-21(2)32(19-23-6-10-27(30)11-7-23)17-15-31-29(34)25-8-9-26-20-33(16-14-24(26)18-25)37(35,36)28-12-4-22(3)5-13-28/h4-13,18,21H,14-17,19-20H2,1-3H3,(H,31,34)
Reactome pathway
n/an/a 392n/an/an/an/an/an/a
University of Kansas Specialized Chemistry Center
Curated by ChEMBL
Assay Description
Antagonist activity against human kappa opioid receptor expressed in human U2OS cells co-expressing beta-arrestin2 pre-treated for 15 mins before U69...
Bioorg Med Chem 23: 3948-56 (2015)
Article DOI: 10.1016/j.bmc.2014.12.033
BindingDB Entry DOI: 10.7270/Q2R49SJX
Kappa-type opioid receptor
(Homo sapiens (Human))
BDBM50097696
(CHEMBL3590192)
Show SMILES CC(C)N(CCNC(=O)c1ccc2CN(CCc2c1)S(=O)(=O)c1ccc(C)cc1)Cc1ccc(Cl)cc1
Show InChI InChI=1S/C29H34ClN3O3S/c1-21(2)32(19-23-6-10-27(30)11-7-23)17-15-31-29(34)25-8-9-26-20-33(16-14-24(26)18-25)37(35,36)28-12-4-22(3)5-13-28/h4-13,18,21H,14-17,19-20H2,1-3H3,(H,31,34)
Reactome pathway
n/an/a 400n/an/an/an/an/an/a
University of Kansas Specialized Chemistry Center
Curated by ChEMBL
Assay Description
Antagonist activity against HA-tagged human recombinant kappa opioid receptor expressed in CHO cells assessed as inhibition of U69,593-induced ERK ph...
Bioorg Med Chem 23: 3948-56 (2015)
Article DOI: 10.1016/j.bmc.2014.12.033
BindingDB Entry DOI: 10.7270/Q2R49SJX