null
SMILES: FC(F)(F)CNC(=O)C1(CCCCN2CCC(CC2)NC(=O)c2ccccc2-c2ccc(cc2)C(F)(F)F)c2ccccc2-c2ccccc12
InChI Key: InChIKey=MBBCVAKAJPKAKM-UHFFFAOYSA-N
Activity Spreadsheet -- Enzyme Inhibition Constant Data from BindingDB
Found 3 hits for monomerid = 50098320
Trg + Lig
Ki
nM
ΔG°
kcal/mole
IC50
nM
Kd
nM
EC50/IC50
nM
koff
s-1
kon
M-1s-1
pHTemp
°C
Microsomal triglyceride transfer protein large subunit
(Homo sapiens (Human))
BDBM50098320
(9-(4-{4-[(4''-Trifluoromethyl-biphenyl-2-carbonyl)...)
Show SMILES FC(F)(F)CNC(=O)C1(CCCCN2CCC(CC2)NC(=O)c2ccccc2-c2ccc(cc2)C(F)(F)F)c2ccccc2-c2ccccc12
Show InChI InChI=1S/C39H37F6N3O2/c40-38(41,42)25-46-36(50)37(33-13-5-3-10-30(33)31-11-4-6-14-34(31)37)21-7-8-22-48-23-19-28(20-24-48)47-35(49)32-12-2-1-9-29(32)26-15-17-27(18-16-26)39(43,44)45/h1-6,9-18,28H,7-8,19-25H2,(H,46,50)(H,47,49)
Reactome pathway
n/an/a 0.800n/an/an/an/an/an/a
The Bristol-Myers Squibb Pharmaceutical Research Institute
Curated by ChEMBL
Assay Description
In vitro inhibition of human microsomal triglyceride transfer protein in HepG2 cells using apoB secretion assay
J Med Chem 44: 851-6 (2001)
BindingDB Entry DOI: 10.7270/Q2N015S8
Microsomal triglyceride transfer protein large subunit
(Homo sapiens (Human))
BDBM50098320
(9-(4-{4-[(4''-Trifluoromethyl-biphenyl-2-carbonyl)...)
Show SMILES FC(F)(F)CNC(=O)C1(CCCCN2CCC(CC2)NC(=O)c2ccccc2-c2ccc(cc2)C(F)(F)F)c2ccccc2-c2ccccc12
Show InChI InChI=1S/C39H37F6N3O2/c40-38(41,42)25-46-36(50)37(33-13-5-3-10-30(33)31-11-4-6-14-34(31)37)21-7-8-22-48-23-19-28(20-24-48)47-35(49)32-12-2-1-9-29(32)26-15-17-27(18-16-26)39(43,44)45/h1-6,9-18,28H,7-8,19-25H2,(H,46,50)(H,47,49)
Reactome pathway
n/an/a 8n/an/an/an/an/an/a
Bristol-Myers Squibb Pharmaceutical Research Institute
Curated by ChEMBL
Assay Description
In vitro inhibitory concentration against human Microsomal triglyceride transfer protein
Bioorg Med Chem Lett 14: 5067-70 (2004)
Article DOI: 10.1016/j.bmcl.2004.07.069
BindingDB Entry DOI: 10.7270/Q2H70F93
Microsomal triglyceride transfer protein large subunit
(Homo sapiens (Human))
BDBM50098320
(9-(4-{4-[(4''-Trifluoromethyl-biphenyl-2-carbonyl)...)
Show SMILES FC(F)(F)CNC(=O)C1(CCCCN2CCC(CC2)NC(=O)c2ccccc2-c2ccc(cc2)C(F)(F)F)c2ccccc2-c2ccccc12
Show InChI InChI=1S/C39H37F6N3O2/c40-38(41,42)25-46-36(50)37(33-13-5-3-10-30(33)31-11-4-6-14-34(31)37)21-7-8-22-48-23-19-28(20-24-48)47-35(49)32-12-2-1-9-29(32)26-15-17-27(18-16-26)39(43,44)45/h1-6,9-18,28H,7-8,19-25H2,(H,46,50)(H,47,49)
Reactome pathway
n/an/a 8n/an/an/an/an/an/a
The Bristol-Myers Squibb Pharmaceutical Research Institute
Curated by ChEMBL
Assay Description
In vitro inhibition of human microsomal triglyceride transfer protein using triglyceride transfer assay
J Med Chem 44: 851-6 (2001)
BindingDB Entry DOI: 10.7270/Q2N015S8