null
SMILES: CCCc1nc2c(NC(=O)c3ccccc3-c3ccc(cc3)C(F)(F)F)cccc2n1CCCCC1(C(=O)NCC(F)(F)F)c2ccccc2-c2ccccc12
InChI Key: InChIKey=XDAAXEXRKIXQMQ-UHFFFAOYSA-N
Activity Spreadsheet -- Enzyme Inhibition Constant Data from BindingDB
Found 1 hit for monomerid = 50098323
Trg + Lig
Ki
nM
ΔG°
kcal/mole
IC50
nM
Kd
nM
EC50/IC50
nM
koff
s-1
kon
M-1s-1
pHTemp
°C
Microsomal triglyceride transfer protein large subunit
(Homo sapiens (Human))
BDBM50098323
(9-(4-{2-Propyl-4-[(4'-trifluoromethyl-biphenyl-2-c...)
Show SMILES CCCc1nc2c(NC(=O)c3ccccc3-c3ccc(cc3)C(F)(F)F)cccc2n1CCCCC1(C(=O)NCC(F)(F)F)c2ccccc2-c2ccccc12
Show InChI InChI=1S/C44H38F6N4O2/c1-2-12-38-53-39-36(52-40(55)33-16-4-3-13-30(33)28-21-23-29(24-22-28)44(48,49)50)19-11-20-37(39)54(38)26-10-9-25-42(41(56)51-27-43(45,46)47)34-17-7-5-14-31(34)32-15-6-8-18-35(32)42/h3-8,11,13-24H,2,9-10,12,25-27H2,1H3,(H,51,56)(H,52,55)
Reactome pathway
n/an/a 2n/an/an/an/an/an/a
The Bristol-Myers Squibb Pharmaceutical Research Institute
Curated by ChEMBL
Assay Description
In vitro inhibition of human Microsomal Triglyceride Transfer Protein, (triglyceride transfer assay)
J Med Chem 44: 851-6 (2001)
BindingDB Entry DOI: 10.7270/Q2N015S8