null
SMILES: CC(=O)N1CCC(CO[C@@H]2CNCC[C@H]2Nc2nccc3cc(C)c(=O)[nH]c23)CC1
InChI Key:
Activity Spreadsheet -- Enzyme Inhibition Constant Data from BindingDB
Found 2 hits for monomerid = 50098328
Trg + Lig
Ki
nM
ΔG°
kcal/mole
IC50
nM
Kd
nM
EC50/IC50
nM
koff
s-1
kon
M-1s-1
pHTemp
°C
ATPase family AAA domain-containing protein 2
(Homo sapiens (Human))
BDBM50098328
(CHEMBL3590392)
Show SMILES CC(=O)N1CCC(CO[C@@H]2CNCC[C@H]2Nc2nccc3cc(C)c(=O)[nH]c23)CC1 |r|
n/an/a 7.94E+3n/an/an/an/an/an/a
GlaxoSmithKline
Curated by ChEMBL
Assay Description
Displacement of histone H4 peptide from FLAG-6His-Tev-ATAD2 (981 to 1121) (unknown origin) expressed in Escherichia coli BL21 (DE3) after 30 mins by ...
J Med Chem 58: 6151-78 (2015)
Article DOI: 10.1021/acs.jmedchem.5b00773
BindingDB Entry DOI: 10.7270/Q2FN17Z1
Bromodomain-containing protein 4
(Homo sapiens (Human))
BDBM50098328
(CHEMBL3590392)
Show SMILES CC(=O)N1CCC(CO[C@@H]2CNCC[C@H]2Nc2nccc3cc(C)c(=O)[nH]c23)CC1 |r|
n/an/a 1.00E+4n/an/an/an/an/an/a
GlaxoSmithKline
Curated by ChEMBL
Assay Description
Displacement of I-BET762 from 6His-Thr-BRD4 (1 to 477) BD1 (unknown origin) harboring BD2 Y390A mutant after 30 mins by TR-FRET analysis
J Med Chem 58: 6151-78 (2015)
Article DOI: 10.1021/acs.jmedchem.5b00773
BindingDB Entry DOI: 10.7270/Q2FN17Z1