BDBM50098388 2-(4-aminophenyl)-1-hydroxy-ethane-1,1-bisphosphonate::2-(4-aminophenyl)-1-hydroxyethane-1,1-diyldiphosphonic acid::CHEMBL417932::[2-(4-Amino-phenyl)-1-hydroxy-1-phosphono-ethyl]-phosphonic acid
SMILES: Nc1ccc(CC(O)(P(O)(O)=O)P(O)(O)=O)cc1
InChI Key: InChIKey=BRTBLZVYDKNGQX-UHFFFAOYSA-N
Data: 1 KI  4 IC50
Activity Spreadsheet -- Enzyme Inhibition Constant Data from BindingDB
Found 5 hits for monomerid = 50098388
Trg + Lig
Ki
nM
ΔG°
kcal/mole
IC50
nM
Kd
nM
EC50/IC50
nM
koff
s-1
kon
M-1s-1
pHTemp
°C
Farnesyl diphosphate synthase
(Homo sapiens (Human))
BDBM50098388
(2-(4-aminophenyl)-1-hydroxy-ethane-1,1-bisphosphon...)
Show SMILES Nc1ccc(CC(O)(P(O)(O)=O)P(O)(O)=O)cc1
Show InChI InChI=1S/C8H13NO7P2/c9-7-3-1-6(2-4-7)5-8(10,17(11,12)13)18(14,15)16/h1-4,10H,5,9H2,(H2,11,12,13)(H2,14,15,16)
Reactome pathway
4.20E+3n/an/an/an/an/an/an/an/a
University of Illinois at Urbana-Champaign
Curated by ChEMBL
Assay Description
Binding affinity towards farnesyl Pyrophosphate Synthase using [14C]- isopentenyl pyrophosphate as radioligand
J Med Chem 46: 5171-83 (2003)
Article DOI: 10.1021/jm0302344
BindingDB Entry DOI: 10.7270/Q24M93Z8
Geranylgeranyl Diphosphate Synthase (GGPPS)
(Homo sapiens (Human))
BDBM50098388
(2-(4-aminophenyl)-1-hydroxy-ethane-1,1-bisphosphon...)
Show SMILES Nc1ccc(CC(O)(P(O)(O)=O)P(O)(O)=O)cc1
Show InChI InChI=1S/C8H13NO7P2/c9-7-3-1-6(2-4-7)5-8(10,17(11,12)13)18(14,15)16/h1-4,10H,5,9H2,(H2,11,12,13)(H2,14,15,16)
Reactome pathway
n/an/a 1.80E+5n/an/an/an/an/an/a
University of Illinois at Urbana-Champaign
Curated by ChEMBL
Assay Description
Inhibitory activity against the human recombinant geranylgeranyl diphosphate synthase (GGPPSase).
J Med Chem 45: 2185-96 (2002)
BindingDB Entry DOI: 10.7270/Q2KH0MN1
Farnesyl diphosphate synthase
(Homo sapiens (Human))
BDBM50098388
(2-(4-aminophenyl)-1-hydroxy-ethane-1,1-bisphosphon...)
Show SMILES Nc1ccc(CC(O)(P(O)(O)=O)P(O)(O)=O)cc1
Show InChI InChI=1S/C8H13NO7P2/c9-7-3-1-6(2-4-7)5-8(10,17(11,12)13)18(14,15)16/h1-4,10H,5,9H2,(H2,11,12,13)(H2,14,15,16)
Reactome pathway
n/an/a 4.37E+4n/an/an/an/an/an/a
University of Illinois at Urbana-Champaign
Curated by ChEMBL
Assay Description
Inhibitory activity against farnesyl Pyrophosphate Synthase expressed as #NAME? (M)
J Med Chem 46: 5171-83 (2003)
Article DOI: 10.1021/jm0302344
BindingDB Entry DOI: 10.7270/Q24M93Z8
Vacuolar-type proton translocating pyrophosphatase 1
(Trypanosoma brucei)
BDBM50098388
(2-(4-aminophenyl)-1-hydroxy-ethane-1,1-bisphosphon...)
Show SMILES Nc1ccc(CC(O)(P(O)(O)=O)P(O)(O)=O)cc1
Show InChI InChI=1S/C8H13NO7P2/c9-7-3-1-6(2-4-7)5-8(10,17(11,12)13)18(14,15)16/h1-4,10H,5,9H2,(H2,11,12,13)(H2,14,15,16)
n/an/a 5.50E+4n/an/an/an/an/an/a
University of Illinois at Urbana-Champaign
Curated by ChEMBL
Assay Description
Inhibition of recombinant Trypanosoma brucei soluble vacuolar pyrophosphatase expressed in Escherichia coli
J Med Chem 48: 6128-39 (2005)
Article DOI: 10.1021/jm058220g
BindingDB Entry DOI: 10.7270/Q2F47PX2
Farnesyl diphosphate synthase
(Homo sapiens (Human))
BDBM50098388
(2-(4-aminophenyl)-1-hydroxy-ethane-1,1-bisphosphon...)
Show SMILES Nc1ccc(CC(O)(P(O)(O)=O)P(O)(O)=O)cc1
Show InChI InChI=1S/C8H13NO7P2/c9-7-3-1-6(2-4-7)5-8(10,17(11,12)13)18(14,15)16/h1-4,10H,5,9H2,(H2,11,12,13)(H2,14,15,16)
Reactome pathway
n/an/a 4.30E+4n/an/an/an/an/an/a
University of Illinois at Urbana-Champaign
Curated by ChEMBL
Assay Description
Inhibitory activity against farnesyl Pyrophosphate Synthase was determined
J Med Chem 46: 5171-83 (2003)
Article DOI: 10.1021/jm0302344
BindingDB Entry DOI: 10.7270/Q24M93Z8