BDBM50098523 4-(4-Chloro-benzylsulfanyl)-thieno[2,3-c]pyridine-2-carboxylic acid amide::CHEMBL269570
SMILES: NC(=O)c1cc2c(SCc3ccc(Cl)cc3)cncc2s1
InChI Key: InChIKey=NXPULJKXDBZNKI-UHFFFAOYSA-N
Data: 3 IC50
Activity Spreadsheet -- Enzyme Inhibition Constant Data from BindingDB
Found 3 hits for monomerid = 50098523
Trg + Lig
Ki
nM
ΔG°
kcal/mole
IC50
nM
Kd
nM
EC50/IC50
nM
koff
s-1
kon
M-1s-1
pHTemp
°C
VCAM-1
(Homo sapiens (Human))
BDBM50098523
(4-(4-Chloro-benzylsulfanyl)-thieno[2,3-c]pyridine-...)
Show SMILES NC(=O)c1cc2c(SCc3ccc(Cl)cc3)cncc2s1
Show InChI InChI=1S/C15H11ClN2OS2/c16-10-3-1-9(2-4-10)8-20-13-6-18-7-14-11(13)5-12(21-14)15(17)19/h1-7H,8H2,(H2,17,19)
n/an/a>1.00E+3n/an/an/an/an/an/a
Abbott Laboratories
Curated by ChEMBL
Assay Description
In vitro potency against TNF alpha induced expresion of VCAM-1 on human vascular endothelial cells using CAM ELISA assay
J Med Chem 44: 988-1002 (2001)
BindingDB Entry DOI: 10.7270/Q2CF9PC4
Selectin E
(Homo sapiens (Human))
BDBM50098523
(4-(4-Chloro-benzylsulfanyl)-thieno[2,3-c]pyridine-...)
Show SMILES NC(=O)c1cc2c(SCc3ccc(Cl)cc3)cncc2s1
Show InChI InChI=1S/C15H11ClN2OS2/c16-10-3-1-9(2-4-10)8-20-13-6-18-7-14-11(13)5-12(21-14)15(17)19/h1-7H,8H2,(H2,17,19)
NCI pathway
Reactome pathway
n/an/a 340n/an/an/an/an/an/a
Abbott Laboratories
Curated by ChEMBL
Assay Description
In vitro potency against TNF alpha induced expression of Selectin E on human vascular endothelial cells using CAM ELISA assay
J Med Chem 44: 988-1002 (2001)
BindingDB Entry DOI: 10.7270/Q2CF9PC4
Intercellular adhesion molecule (ICAM-1), Integrin alpha-L/beta-2
(Homo sapiens (Human))
BDBM50098523
(4-(4-Chloro-benzylsulfanyl)-thieno[2,3-c]pyridine-...)
Show SMILES NC(=O)c1cc2c(SCc3ccc(Cl)cc3)cncc2s1
Show InChI InChI=1S/C15H11ClN2OS2/c16-10-3-1-9(2-4-10)8-20-13-6-18-7-14-11(13)5-12(21-14)15(17)19/h1-7H,8H2,(H2,17,19)
NCI pathway
Reactome pathway
n/an/a 690n/an/an/an/an/an/a
Abbott Laboratories
Curated by ChEMBL
Assay Description
In vitro potency against TNF alpha induced expresion of intercellular adhesion molecule-1 on human vascular endothelial cells using CAM ELISA assay
J Med Chem 44: 988-1002 (2001)
BindingDB Entry DOI: 10.7270/Q2CF9PC4