BDBM50098645 CHEMBL286355::N-(1-Cyclooctylmethyl-piperidin-4-yl)-2,2-diphenyl-acetamide
SMILES: O=C(NC1CCN(CC2CCCCCCC2)CC1)C(c1ccccc1)c1ccccc1
InChI Key: InChIKey=FORGSABZBFVYHJ-UHFFFAOYSA-N
Data: 2 IC50
Activity Spreadsheet -- Enzyme Inhibition Constant Data from BindingDB
Found 2 hits for monomerid = 50098645
Trg + Lig
Ki
nM
ΔG°
kcal/mole
IC50
nM
Kd
nM
EC50/IC50
nM
koff
s-1
kon
M-1s-1
pHTemp
°C
C-C chemokine receptor type 1
(Homo sapiens (Human))
BDBM50098645
(CHEMBL286355 | N-(1-Cyclooctylmethyl-piperidin-4-y...)
Show SMILES O=C(NC1CCN(CC2CCCCCCC2)CC1)C(c1ccccc1)c1ccccc1
Show InChI InChI=1S/C28H38N2O/c31-28(27(24-14-8-4-9-15-24)25-16-10-5-11-17-25)29-26-18-20-30(21-19-26)22-23-12-6-2-1-3-7-13-23/h4-5,8-11,14-17,23,26-27H,1-3,6-7,12-13,18-22H2,(H,29,31)
Reactome pathway
n/an/a 1.10E+3n/an/an/an/an/an/a
Banyu Tsukuba Research Institute in collaboration with Merck Research Laboratories
Curated by ChEMBL
Assay Description
Inhibitory activity against [125I]-MIP-1 alpha binding to human CCR1 receptors.
J Med Chem 44: 1429-35 (2001)
BindingDB Entry DOI: 10.7270/Q2G73D0G
C-C chemokine receptor type 1
(Mus musculus)
BDBM50098645
(CHEMBL286355 | N-(1-Cyclooctylmethyl-piperidin-4-y...)
Show SMILES O=C(NC1CCN(CC2CCCCCCC2)CC1)C(c1ccccc1)c1ccccc1
Show InChI InChI=1S/C28H38N2O/c31-28(27(24-14-8-4-9-15-24)25-16-10-5-11-17-25)29-26-18-20-30(21-19-26)22-23-12-6-2-1-3-7-13-23/h4-5,8-11,14-17,23,26-27H,1-3,6-7,12-13,18-22H2,(H,29,31)
n/an/a>1.00E+4n/an/an/an/an/an/a
Banyu Tsukuba Research Institute in collaboration with Merck Research Laboratories
Curated by ChEMBL
Assay Description
Inhibitory activity against [125I]-MIP-1 alpha binding to mouse CCR1 receptors.
J Med Chem 44: 1429-35 (2001)
BindingDB Entry DOI: 10.7270/Q2G73D0G