BDBM50098771 1-(4-Acetyl-piperazin-1-yl)-3-[3-chloro-4-(1-methyl-1H-indol-5-ylsulfanyl)-phenyl]-propenone::CHEMBL19837
SMILES: CC(=O)N1CCN(CC1)C(=O)\C=C\c1ccc(Sc2ccc3n(C)ccc3c2)c(Cl)c1
InChI Key: InChIKey=FOXOPJJICTTZEU-XBXARRHUSA-N
Data: 1 IC50
Activity Spreadsheet -- Enzyme Inhibition Constant Data from BindingDB
Found 1 hit for monomerid = 50098771
Trg + Lig
Ki
nM
ΔG°
kcal/mole
IC50
nM
Kd
nM
EC50/IC50
nM
koff
s-1
kon
M-1s-1
pHTemp
°C
Integrin beta-2/Leukocyte adhesion glycoprotein LFA-1 alpha
(Homo sapiens (Human))
BDBM50098771
(1-(4-Acetyl-piperazin-1-yl)-3-[3-chloro-4-(1-methy...)
Show SMILES CC(=O)N1CCN(CC1)C(=O)\C=C\c1ccc(Sc2ccc3n(C)ccc3c2)c(Cl)c1
Show InChI InChI=1S/C24H24ClN3O2S/c1-17(29)27-11-13-28(14-12-27)24(30)8-4-18-3-7-23(21(25)15-18)31-20-5-6-22-19(16-20)9-10-26(22)2/h3-10,15-16H,11-14H2,1-2H3/b8-4+
n/an/a 20n/an/an/an/an/an/a
Abbott Laboratories
Curated by ChEMBL
Assay Description
Inhibition of JY-8 cell adhesion via leukocyte function associated antigen 1 (LFA-1) to ICAM-1
J Med Chem 44: 1202-10 (2001)
BindingDB Entry DOI: 10.7270/Q22Z14TP