BDBM50098913 (R)-1,4-Bis-(4-methoxy-benzenesulfonyl)-[1,4]diazepane-5-carboxylic acid hydroxyamide::CHEMBL427616
SMILES: COc1ccc(cc1)S(=O)(=O)N1CC[C@@H](N(CC1)S(=O)(=O)c1ccc(OC)cc1)C(=O)NO
InChI Key: InChIKey=KKVTZTBYJGHGCO-LJQANCHMSA-N
Data: 7 IC50
Activity Spreadsheet -- Enzyme Inhibition Constant Data from BindingDB
Found 7 hits for monomerid = 50098913
Trg + Lig
Ki
nM
ΔG°
kcal/mole
IC50
nM
Kd
nM
EC50/IC50
nM
koff
s-1
kon
M-1s-1
pHTemp
°C
Interstitial collagenase
(Homo sapiens (Human))
BDBM50098913
((R)-1,4-Bis-(4-methoxy-benzenesulfonyl)-[1,4]diaze...)
Show SMILES COc1ccc(cc1)S(=O)(=O)N1CC[C@@H](N(CC1)S(=O)(=O)c1ccc(OC)cc1)C(=O)NO
Show InChI InChI=1S/C20H25N3O8S2/c1-30-15-3-7-17(8-4-15)32(26,27)22-12-11-19(20(24)21-25)23(14-13-22)33(28,29)18-9-5-16(31-2)6-10-18/h3-10,19,25H,11-14H2,1-2H3,(H,21,24)/t19-/m1/s1
Reactome pathway
n/an/a 29n/an/an/an/an/an/a
Procter and Gamble Pharmaceuticals
Curated by ChEMBL
Assay Description
Inhibition of human Matrix metalloprotease-1
Bioorg Med Chem Lett 11: 1009-13 (2001)
BindingDB Entry DOI: 10.7270/Q2X34Z04
Matrix metalloproteinase 13
(Rattus norvegicus)
BDBM50098913
((R)-1,4-Bis-(4-methoxy-benzenesulfonyl)-[1,4]diaze...)
Show SMILES COc1ccc(cc1)S(=O)(=O)N1CC[C@@H](N(CC1)S(=O)(=O)c1ccc(OC)cc1)C(=O)NO
Show InChI InChI=1S/C20H25N3O8S2/c1-30-15-3-7-17(8-4-15)32(26,27)22-12-11-19(20(24)21-25)23(14-13-22)33(28,29)18-9-5-16(31-2)6-10-18/h3-10,19,25H,11-14H2,1-2H3,(H,21,24)/t19-/m1/s1
n/an/a 0.840n/an/an/an/an/an/a
Procter and Gamble Pharmaceuticals
Curated by ChEMBL
Assay Description
Inhibition of Matrix metalloprotease-13
Bioorg Med Chem Lett 11: 1009-13 (2001)
BindingDB Entry DOI: 10.7270/Q2X34Z04
Matrix metalloproteinase-9
(Homo sapiens (Human))
BDBM50098913
((R)-1,4-Bis-(4-methoxy-benzenesulfonyl)-[1,4]diaze...)
Show SMILES COc1ccc(cc1)S(=O)(=O)N1CC[C@@H](N(CC1)S(=O)(=O)c1ccc(OC)cc1)C(=O)NO
Show InChI InChI=1S/C20H25N3O8S2/c1-30-15-3-7-17(8-4-15)32(26,27)22-12-11-19(20(24)21-25)23(14-13-22)33(28,29)18-9-5-16(31-2)6-10-18/h3-10,19,25H,11-14H2,1-2H3,(H,21,24)/t19-/m1/s1
Reactome pathway
n/an/a 0.5n/an/an/an/an/an/a
Procter and Gamble Pharmaceuticals
Curated by ChEMBL
Assay Description
Inhibition of Matrix metalloprotease-9
Bioorg Med Chem Lett 11: 1009-13 (2001)
BindingDB Entry DOI: 10.7270/Q2X34Z04
Matrix metalloproteinase-7 (MMP7)
(Homo sapiens (Human))
BDBM50098913
((R)-1,4-Bis-(4-methoxy-benzenesulfonyl)-[1,4]diaze...)
Show SMILES COc1ccc(cc1)S(=O)(=O)N1CC[C@@H](N(CC1)S(=O)(=O)c1ccc(OC)cc1)C(=O)NO
Show InChI InChI=1S/C20H25N3O8S2/c1-30-15-3-7-17(8-4-15)32(26,27)22-12-11-19(20(24)21-25)23(14-13-22)33(28,29)18-9-5-16(31-2)6-10-18/h3-10,19,25H,11-14H2,1-2H3,(H,21,24)/t19-/m1/s1
Reactome pathway
n/an/a 905n/an/an/an/an/an/a
Procter and Gamble Pharmaceuticals
Curated by ChEMBL
Assay Description
Inhibition of Matrix metalloprotease-7
Bioorg Med Chem Lett 11: 1009-13 (2001)
BindingDB Entry DOI: 10.7270/Q2X34Z04
72 kDa type IV collagenase
(Homo sapiens (Human))
BDBM50098913
((R)-1,4-Bis-(4-methoxy-benzenesulfonyl)-[1,4]diaze...)
Show SMILES COc1ccc(cc1)S(=O)(=O)N1CC[C@@H](N(CC1)S(=O)(=O)c1ccc(OC)cc1)C(=O)NO
Show InChI InChI=1S/C20H25N3O8S2/c1-30-15-3-7-17(8-4-15)32(26,27)22-12-11-19(20(24)21-25)23(14-13-22)33(28,29)18-9-5-16(31-2)6-10-18/h3-10,19,25H,11-14H2,1-2H3,(H,21,24)/t19-/m1/s1
Reactome pathway
n/an/a 0.5n/an/an/an/an/an/a
Procter and Gamble Pharmaceuticals
Curated by ChEMBL
Assay Description
Inhibition of human Matrix metalloprotease-2
Bioorg Med Chem Lett 11: 1009-13 (2001)
BindingDB Entry DOI: 10.7270/Q2X34Z04
Neutrophil collagenase
(Homo sapiens (Human))
BDBM50098913
((R)-1,4-Bis-(4-methoxy-benzenesulfonyl)-[1,4]diaze...)
Show SMILES COc1ccc(cc1)S(=O)(=O)N1CC[C@@H](N(CC1)S(=O)(=O)c1ccc(OC)cc1)C(=O)NO
Show InChI InChI=1S/C20H25N3O8S2/c1-30-15-3-7-17(8-4-15)32(26,27)22-12-11-19(20(24)21-25)23(14-13-22)33(28,29)18-9-5-16(31-2)6-10-18/h3-10,19,25H,11-14H2,1-2H3,(H,21,24)/t19-/m1/s1
Reactome pathway
n/an/a 1.80n/an/an/an/an/an/a
Procter and Gamble Pharmaceuticals
Curated by ChEMBL
Assay Description
Inhibition of Matrix metalloprotease-8
Bioorg Med Chem Lett 11: 1009-13 (2001)
BindingDB Entry DOI: 10.7270/Q2X34Z04
Stromelysin-1
(Homo sapiens (Human))
BDBM50098913
((R)-1,4-Bis-(4-methoxy-benzenesulfonyl)-[1,4]diaze...)
Show SMILES COc1ccc(cc1)S(=O)(=O)N1CC[C@@H](N(CC1)S(=O)(=O)c1ccc(OC)cc1)C(=O)NO
Show InChI InChI=1S/C20H25N3O8S2/c1-30-15-3-7-17(8-4-15)32(26,27)22-12-11-19(20(24)21-25)23(14-13-22)33(28,29)18-9-5-16(31-2)6-10-18/h3-10,19,25H,11-14H2,1-2H3,(H,21,24)/t19-/m1/s1
Reactome pathway
n/an/a 6.30n/an/an/an/an/an/a
Procter and Gamble Pharmaceuticals
Curated by ChEMBL
Assay Description
Inhibition of Matrix metalloprotease-3
Bioorg Med Chem Lett 11: 1009-13 (2001)
BindingDB Entry DOI: 10.7270/Q2X34Z04