BDBM50099338 2-(Benzo[1,3]dioxol-5-yloxy)-4-[5-(4-fluoro-phenyl)-3-piperidin-4-yl-3H-imidazol-4-yl]-pyrimidine::CHEMBL273611
SMILES: Fc1ccc(cc1)-c1ncn(C2CCNCC2)c1-c1ccnc(Oc2ccc3OCOc3c2)n1
InChI Key: InChIKey=OYUMKIMOEUHNPB-UHFFFAOYSA-N
Data: 2 IC50
Activity Spreadsheet -- Enzyme Inhibition Constant Data from BindingDB
Found 2 hits for monomerid = 50099338
Trg + Lig
Ki
nM
ΔG°
kcal/mole
IC50
nM
Kd
nM
EC50/IC50
nM
koff
s-1
kon
M-1s-1
pHTemp
°C
Mitogen-activated protein kinase 14
(Homo sapiens (Human))
BDBM50099338
(2-(Benzo[1,3]dioxol-5-yloxy)-4-[5-(4-fluoro-phenyl...)
Show SMILES Fc1ccc(cc1)-c1ncn(C2CCNCC2)c1-c1ccnc(Oc2ccc3OCOc3c2)n1
Show InChI InChI=1S/C25H22FN5O3/c26-17-3-1-16(2-4-17)23-24(31(14-29-23)18-7-10-27-11-8-18)20-9-12-28-25(30-20)34-19-5-6-21-22(13-19)33-15-32-21/h1-6,9,12-14,18,27H,7-8,10-11,15H2
NCI pathway
Reactome pathway
n/an/a 23n/an/an/an/an/an/a
University College of Pharmaceutical Sciences
Curated by ChEMBL
Assay Description
Inhibition of p38alpha
Eur J Med Chem 43: 830-8 (2008)
Article DOI: 10.1016/j.ejmech.2007.06.009
BindingDB Entry DOI: 10.7270/Q28052ZC
Mitogen-activated protein kinase 14
(Homo sapiens (Human))
BDBM50099338
(2-(Benzo[1,3]dioxol-5-yloxy)-4-[5-(4-fluoro-phenyl...)
Show SMILES Fc1ccc(cc1)-c1ncn(C2CCNCC2)c1-c1ccnc(Oc2ccc3OCOc3c2)n1
Show InChI InChI=1S/C25H22FN5O3/c26-17-3-1-16(2-4-17)23-24(31(14-29-23)18-7-10-27-11-8-18)20-9-12-28-25(30-20)34-19-5-6-21-22(13-19)33-15-32-21/h1-6,9,12-14,18,27H,7-8,10-11,15H2
NCI pathway
Reactome pathway
n/an/a 23n/an/an/an/an/an/a
GlaxoSmithKline Pharmaceuticals
Curated by ChEMBL
Assay Description
Inhibitory concentration against mitogen-activated protein kinase p38 alpha
Bioorg Med Chem Lett 11: 1123-6 (2001)
BindingDB Entry DOI: 10.7270/Q2028QTS