BDBM50099341 4-[5-(4-Fluoro-phenyl)-3-piperidin-4-yl-3H-imidazol-4-yl]-2-(3-methoxy-phenoxy)-pyrimidine::CHEMBL14300
SMILES: COc1cccc(Oc2nccc(n2)-c2c(ncn2C2CCNCC2)-c2ccc(F)cc2)c1
InChI Key: InChIKey=VSEXCRCUHFHFTK-UHFFFAOYSA-N
Data: 2 IC50
Activity Spreadsheet -- Enzyme Inhibition Constant Data from BindingDB
Found 2 hits for monomerid = 50099341
Trg + Lig
Ki
nM
ΔG°
kcal/mole
IC50
nM
Kd
nM
EC50/IC50
nM
koff
s-1
kon
M-1s-1
pHTemp
°C
Mitogen-activated protein kinase 14
(Homo sapiens (Human))
BDBM50099341
(4-[5-(4-Fluoro-phenyl)-3-piperidin-4-yl-3H-imidazo...)
Show SMILES COc1cccc(Oc2nccc(n2)-c2c(ncn2C2CCNCC2)-c2ccc(F)cc2)c1
Show InChI InChI=1S/C25H24FN5O2/c1-32-20-3-2-4-21(15-20)33-25-28-14-11-22(30-25)24-23(17-5-7-18(26)8-6-17)29-16-31(24)19-9-12-27-13-10-19/h2-8,11,14-16,19,27H,9-10,12-13H2,1H3
NCI pathway
Reactome pathway
n/an/a 20n/an/an/an/an/an/a
University College of Pharmaceutical Sciences
Curated by ChEMBL
Assay Description
Inhibition of p38alpha
Eur J Med Chem 43: 830-8 (2008)
Article DOI: 10.1016/j.ejmech.2007.06.009
BindingDB Entry DOI: 10.7270/Q28052ZC
Mitogen-activated protein kinase 14
(Homo sapiens (Human))
BDBM50099341
(4-[5-(4-Fluoro-phenyl)-3-piperidin-4-yl-3H-imidazo...)
Show SMILES COc1cccc(Oc2nccc(n2)-c2c(ncn2C2CCNCC2)-c2ccc(F)cc2)c1
Show InChI InChI=1S/C25H24FN5O2/c1-32-20-3-2-4-21(15-20)33-25-28-14-11-22(30-25)24-23(17-5-7-18(26)8-6-17)29-16-31(24)19-9-12-27-13-10-19/h2-8,11,14-16,19,27H,9-10,12-13H2,1H3
NCI pathway
Reactome pathway
n/an/a 19n/an/an/an/an/an/a
GlaxoSmithKline Pharmaceuticals
Curated by ChEMBL
Assay Description
Inhibitory concentration against mitogen-activated protein kinase p38 alpha
Bioorg Med Chem Lett 11: 1123-6 (2001)
BindingDB Entry DOI: 10.7270/Q2028QTS