BDBM50099344 3-{4-[5-(4-Fluoro-phenyl)-3-piperidin-4-yl-3H-imidazol-4-yl]-pyrimidin-2-yloxy}-phenol::CHEMBL14125
SMILES: Oc1cccc(Oc2nccc(n2)-c2c(ncn2C2CCNCC2)-c2ccc(F)cc2)c1
InChI Key: InChIKey=URDPGLQTEQTXTL-UHFFFAOYSA-N
Data: 1 IC50
Activity Spreadsheet -- Enzyme Inhibition Constant Data from BindingDB
Found 1 hit for monomerid = 50099344
Trg + Lig
Ki
nM
ΔG°
kcal/mole
IC50
nM
Kd
nM
EC50/IC50
nM
koff
s-1
kon
M-1s-1
pHTemp
°C
Mitogen-activated protein kinase 14
(Homo sapiens (Human))
BDBM50099344
(3-{4-[5-(4-Fluoro-phenyl)-3-piperidin-4-yl-3H-imid...)
Show SMILES Oc1cccc(Oc2nccc(n2)-c2c(ncn2C2CCNCC2)-c2ccc(F)cc2)c1
Show InChI InChI=1S/C24H22FN5O2/c25-17-6-4-16(5-7-17)22-23(30(15-28-22)18-8-11-26-12-9-18)21-10-13-27-24(29-21)32-20-3-1-2-19(31)14-20/h1-7,10,13-15,18,26,31H,8-9,11-12H2
NCI pathway
Reactome pathway
n/an/a 20n/an/an/an/an/an/a
GlaxoSmithKline Pharmaceuticals
Curated by ChEMBL
Assay Description
Inhibitory concentration against mitogen-activated protein kinase p38 alpha
Bioorg Med Chem Lett 11: 1123-6 (2001)
BindingDB Entry DOI: 10.7270/Q2028QTS