BDBM50099347 2-(3,4-Dimethyl-phenoxy)-4-[5-(4-fluoro-phenyl)-3-piperidin-4-yl-3H-imidazol-4-yl]-pyrimidine::CHEMBL13880
SMILES: Cc1ccc(Oc2nccc(n2)-c2c(ncn2C2CCNCC2)-c2ccc(F)cc2)cc1C
InChI Key: InChIKey=ZPVIXTLWEIXXCD-UHFFFAOYSA-N
Data: 5 IC50
Activity Spreadsheet -- Enzyme Inhibition Constant Data from BindingDB
Found 5 hits for monomerid = 50099347
Trg + Lig
Ki
nM
ΔG°
kcal/mole
IC50
nM
Kd
nM
EC50/IC50
nM
koff
s-1
kon
M-1s-1
pHTemp
°C
Mitogen-activated protein kinase 14
(Homo sapiens (Human))
BDBM50099347
(2-(3,4-Dimethyl-phenoxy)-4-[5-(4-fluoro-phenyl)-3-...)
Show SMILES Cc1ccc(Oc2nccc(n2)-c2c(ncn2C2CCNCC2)-c2ccc(F)cc2)cc1C
Show InChI InChI=1S/C26H26FN5O/c1-17-3-8-22(15-18(17)2)33-26-29-14-11-23(31-26)25-24(19-4-6-20(27)7-5-19)30-16-32(25)21-9-12-28-13-10-21/h3-8,11,14-16,21,28H,9-10,12-13H2,1-2H3
NCI pathway
Reactome pathway
n/an/a 22n/an/an/an/an/an/a
GlaxoSmithKline Pharmaceuticals
Curated by ChEMBL
Assay Description
Inhibitory concentration against mitogen-activated protein kinase p38 alpha
Bioorg Med Chem Lett 11: 1123-6 (2001)
BindingDB Entry DOI: 10.7270/Q2028QTS
Mitogen-activated protein kinase 14
(Homo sapiens (Human))
BDBM50099347
(2-(3,4-Dimethyl-phenoxy)-4-[5-(4-fluoro-phenyl)-3-...)
Show SMILES Cc1ccc(Oc2nccc(n2)-c2c(ncn2C2CCNCC2)-c2ccc(F)cc2)cc1C
Show InChI InChI=1S/C26H26FN5O/c1-17-3-8-22(15-18(17)2)33-26-29-14-11-23(31-26)25-24(19-4-6-20(27)7-5-19)30-16-32(25)21-9-12-28-13-10-21/h3-8,11,14-16,21,28H,9-10,12-13H2,1-2H3
NCI pathway
Reactome pathway
n/an/a 22n/an/an/an/an/an/a
University College of Pharmaceutical Sciences
Curated by ChEMBL
Assay Description
Inhibition of p38alpha
Eur J Med Chem 43: 830-8 (2008)
Article DOI: 10.1016/j.ejmech.2007.06.009
BindingDB Entry DOI: 10.7270/Q28052ZC
Bromodomain and extra-terminal motif (BET)
(Homo sapiens (Human))
BDBM50099347
(2-(3,4-Dimethyl-phenoxy)-4-[5-(4-fluoro-phenyl)-3-...)
Show SMILES Cc1ccc(Oc2nccc(n2)-c2c(ncn2C2CCNCC2)-c2ccc(F)cc2)cc1C
Show InChI InChI=1S/C26H26FN5O/c1-17-3-8-22(15-18(17)2)33-26-29-14-11-23(31-26)25-24(19-4-6-20(27)7-5-19)30-16-32(25)21-9-12-28-13-10-21/h3-8,11,14-16,21,28H,9-10,12-13H2,1-2H3
n/an/a>2.50E+5n/an/an/an/an/an/a
University of Minnesota
Curated by ChEMBL
Assay Description
Inhibition of human BRDT bromodomain 2 (unknown origin) expressed in Escherichia coli Bl21(DE3) by fluorescence anisotropy
J Med Chem 61: 9316-9334 (2018)
Article DOI: 10.1021/acs.jmedchem.8b01248
Bromodomain-containing protein 4
(Homo sapiens (Human))
BDBM50099347
(2-(3,4-Dimethyl-phenoxy)-4-[5-(4-fluoro-phenyl)-3-...)
Show SMILES Cc1ccc(Oc2nccc(n2)-c2c(ncn2C2CCNCC2)-c2ccc(F)cc2)cc1C
Show InChI InChI=1S/C26H26FN5O/c1-17-3-8-22(15-18(17)2)33-26-29-14-11-23(31-26)25-24(19-4-6-20(27)7-5-19)30-16-32(25)21-9-12-28-13-10-21/h3-8,11,14-16,21,28H,9-10,12-13H2,1-2H3
n/an/a 2.90E+3n/an/an/an/an/an/a
University of Minnesota
Curated by ChEMBL
Assay Description
Inhibition of BRD4 bromodomain 1 (unknown origin) expressed in Escherichia coli Bl21(DE3) by fluorescence anisotropy
J Med Chem 61: 9316-9334 (2018)
Article DOI: 10.1021/acs.jmedchem.8b01248
Bromodomain and extra-terminal motif (BET)
(Homo sapiens (Human))
BDBM50099347
(2-(3,4-Dimethyl-phenoxy)-4-[5-(4-fluoro-phenyl)-3-...)
Show SMILES Cc1ccc(Oc2nccc(n2)-c2c(ncn2C2CCNCC2)-c2ccc(F)cc2)cc1C
Show InChI InChI=1S/C26H26FN5O/c1-17-3-8-22(15-18(17)2)33-26-29-14-11-23(31-26)25-24(19-4-6-20(27)7-5-19)30-16-32(25)21-9-12-28-13-10-21/h3-8,11,14-16,21,28H,9-10,12-13H2,1-2H3
n/an/a 1.30E+4n/an/an/an/an/an/a
University of Minnesota
Curated by ChEMBL
Assay Description
Inhibition of human BRDT bromodomain 1 (unknown origin) expressed in Escherichia coli Bl21(DE3) by fluorescence anisotropy
J Med Chem 61: 9316-9334 (2018)
Article DOI: 10.1021/acs.jmedchem.8b01248