BDBM50099352 4-[5-(4-Fluoro-phenyl)-3-piperidin-4-yl-3H-imidazol-4-yl]-2-p-tolyloxy-pyrimidine::CHEMBL14682
SMILES: Cc1ccc(Oc2nccc(n2)-c2c(ncn2C2CCNCC2)-c2ccc(F)cc2)cc1
InChI Key: InChIKey=MYXXRVIYUKHKPI-UHFFFAOYSA-N
Data: 5 IC50
Activity Spreadsheet -- Enzyme Inhibition Constant Data from BindingDB
Found 5 hits for monomerid = 50099352
Trg + Lig
Ki
nM
ΔG°
kcal/mole
IC50
nM
Kd
nM
EC50/IC50
nM
koff
s-1
kon
M-1s-1
pHTemp
°C
Mitogen-activated protein kinase 14
(Homo sapiens (Human))
BDBM50099352
(4-[5-(4-Fluoro-phenyl)-3-piperidin-4-yl-3H-imidazo...)
Show SMILES Cc1ccc(Oc2nccc(n2)-c2c(ncn2C2CCNCC2)-c2ccc(F)cc2)cc1
Show InChI InChI=1S/C25H24FN5O/c1-17-2-8-21(9-3-17)32-25-28-15-12-22(30-25)24-23(18-4-6-19(26)7-5-18)29-16-31(24)20-10-13-27-14-11-20/h2-9,12,15-16,20,27H,10-11,13-14H2,1H3
NCI pathway
Reactome pathway
n/an/a 19n/an/an/an/an/an/a
GlaxoSmithKline Pharmaceuticals
Curated by ChEMBL
Assay Description
Inhibitory concentration against mitogen-activated protein kinase p38 alpha
Bioorg Med Chem Lett 11: 1123-6 (2001)
BindingDB Entry DOI: 10.7270/Q2028QTS
Mitogen-activated protein kinase 14
(Homo sapiens (Human))
BDBM50099352
(4-[5-(4-Fluoro-phenyl)-3-piperidin-4-yl-3H-imidazo...)
Show SMILES Cc1ccc(Oc2nccc(n2)-c2c(ncn2C2CCNCC2)-c2ccc(F)cc2)cc1
Show InChI InChI=1S/C25H24FN5O/c1-17-2-8-21(9-3-17)32-25-28-15-12-22(30-25)24-23(18-4-6-19(26)7-5-18)29-16-31(24)20-10-13-27-14-11-20/h2-9,12,15-16,20,27H,10-11,13-14H2,1H3
NCI pathway
Reactome pathway
n/an/a 19n/an/an/an/an/an/a
University College of Pharmaceutical Sciences
Curated by ChEMBL
Assay Description
Inhibition of p38alpha
Eur J Med Chem 43: 830-8 (2008)
Article DOI: 10.1016/j.ejmech.2007.06.009
BindingDB Entry DOI: 10.7270/Q28052ZC
Bromodomain and extra-terminal motif (BET)
(Homo sapiens (Human))
BDBM50099352
(4-[5-(4-Fluoro-phenyl)-3-piperidin-4-yl-3H-imidazo...)
Show SMILES Cc1ccc(Oc2nccc(n2)-c2c(ncn2C2CCNCC2)-c2ccc(F)cc2)cc1
Show InChI InChI=1S/C25H24FN5O/c1-17-2-8-21(9-3-17)32-25-28-15-12-22(30-25)24-23(18-4-6-19(26)7-5-18)29-16-31(24)20-10-13-27-14-11-20/h2-9,12,15-16,20,27H,10-11,13-14H2,1H3
n/an/a 8.80E+4n/an/an/an/an/an/a
University of Minnesota
Curated by ChEMBL
Assay Description
Inhibition of human BRDT bromodomain 1 (unknown origin) expressed in Escherichia coli Bl21(DE3) by fluorescence anisotropy
J Med Chem 61: 9316-9334 (2018)
Article DOI: 10.1021/acs.jmedchem.8b01248
Bromodomain and extra-terminal motif (BET)
(Homo sapiens (Human))
BDBM50099352
(4-[5-(4-Fluoro-phenyl)-3-piperidin-4-yl-3H-imidazo...)
Show SMILES Cc1ccc(Oc2nccc(n2)-c2c(ncn2C2CCNCC2)-c2ccc(F)cc2)cc1
Show InChI InChI=1S/C25H24FN5O/c1-17-2-8-21(9-3-17)32-25-28-15-12-22(30-25)24-23(18-4-6-19(26)7-5-18)29-16-31(24)20-10-13-27-14-11-20/h2-9,12,15-16,20,27H,10-11,13-14H2,1H3
n/an/a>2.50E+5n/an/an/an/an/an/a
University of Minnesota
Curated by ChEMBL
Assay Description
Inhibition of human BRDT bromodomain 2 (unknown origin) expressed in Escherichia coli Bl21(DE3) by fluorescence anisotropy
J Med Chem 61: 9316-9334 (2018)
Article DOI: 10.1021/acs.jmedchem.8b01248
Bromodomain-containing protein 4
(Homo sapiens (Human))
BDBM50099352
(4-[5-(4-Fluoro-phenyl)-3-piperidin-4-yl-3H-imidazo...)
Show SMILES Cc1ccc(Oc2nccc(n2)-c2c(ncn2C2CCNCC2)-c2ccc(F)cc2)cc1
Show InChI InChI=1S/C25H24FN5O/c1-17-2-8-21(9-3-17)32-25-28-15-12-22(30-25)24-23(18-4-6-19(26)7-5-18)29-16-31(24)20-10-13-27-14-11-20/h2-9,12,15-16,20,27H,10-11,13-14H2,1H3
n/an/a 2.40E+4n/an/an/an/an/an/a
University of Minnesota
Curated by ChEMBL
Assay Description
Inhibition of BRD4 bromodomain 1 (unknown origin) expressed in Escherichia coli Bl21(DE3) by fluorescence anisotropy
J Med Chem 61: 9316-9334 (2018)
Article DOI: 10.1021/acs.jmedchem.8b01248