BDBM50099839 CHEMBL3319596
SMILES: CCCC[C@H](NC(=O)[C@@H]1CCN1C(=O)[C@H](C)NC(=O)CN=[N+]=[N-])C(=O)N[C@@H](CC(C)C)C(=O)[C@@]1(C)CO1
InChI Key: InChIKey=RPNWEWXYTFWDTR-ZETCQYMHSA-N
Data: 1 IC50
Activity Spreadsheet -- Enzyme Inhibition Constant Data from BindingDB
Found 1 hit for monomerid = 50099839
Trg + Lig
Ki
nM
ΔG°
kcal/mole
IC50
nM
Kd
nM
EC50/IC50
nM
koff
s-1
kon
M-1s-1
pHTemp
°C
Proteasome subunit beta type-9
(Homo sapiens (Human))
BDBM50099839
(CHEMBL3319596)
Show SMILES CCCC[C@H](NC(=O)[C@@H]1CCN1C(=O)[C@H](C)NC(=O)CN=[N+]=[N-])C(=O)N[C@@H](CC(C)C)C(=O)[C@@]1(C)CO1 |r|
Show InChI InChI=1S/C9H13NO2S/c1-6-2-3-8(13-6)7(5-10)4-9(11)12/h2-3,7H,4-5,10H2,1H3,(H,11,12)/t7-/m0/s1
n/an/a 96n/an/an/an/an/an/a
Leiden Institute of Chemistry and Netherlands Proteomics Centre
Curated by ChEMBL
Assay Description
Inhibition of proteasome subunit beta-1i in human Raji cells using BODIPY- epoxomicin by fluorescent densitometry
J Med Chem 57: 6197-209 (2014)
Article DOI: 10.1021/jm500716s
BindingDB Entry DOI: 10.7270/Q2BR8TZT