BDBM50099988 6-Methoxy-7-(3-morpholin-4-yl-propoxy)-4-[4-(pyridin-4-yloxy)-phenylamino]-quinoline-3-carbonitrile::CHEMBL31497
SMILES: COc1cc2c(Nc3ccc(Oc4ccncc4)cc3)c(cnc2cc1OCCCN1CCOCC1)C#N
InChI Key: InChIKey=XZMYIAWIOOTSNV-UHFFFAOYSA-N
Data: 2 IC50
Activity Spreadsheet -- Enzyme Inhibition Constant Data from BindingDB
Found 2 hits for monomerid = 50099988
Trg + Lig
Ki
nM
ΔG°
kcal/mole
IC50
nM
Kd
nM
EC50/IC50
nM
koff
s-1
kon
M-1s-1
pHTemp
°C
Dual specificity mitogen-activated protein kinase kinase 1/Mitogen-activated protein kinase 1/RAF proto-oncogene serine/threonine-protein kinase
(Homo sapiens (Human))
BDBM50099988
(6-Methoxy-7-(3-morpholin-4-yl-propoxy)-4-[4-(pyrid...)
Show SMILES COc1cc2c(Nc3ccc(Oc4ccncc4)cc3)c(cnc2cc1OCCCN1CCOCC1)C#N
Show InChI InChI=1S/C29H29N5O4/c1-35-27-17-25-26(18-28(27)37-14-2-11-34-12-15-36-16-13-34)32-20-21(19-30)29(25)33-22-3-5-23(6-4-22)38-24-7-9-31-10-8-24/h3-10,17-18,20H,2,11-16H2,1H3,(H,32,33)
Reactome pathway
n/an/a 26n/an/an/an/an/an/a
Wyeth-Ayerst Research
Curated by ChEMBL
Assay Description
Inhibitory activity against Dual specificity mitogen-activated protein kinase kinase using direct MEK assay (which by-passes the need for activated R...
Bioorg Med Chem Lett 11: 1407-10 (2001)
BindingDB Entry DOI: 10.7270/Q2RB73WF
Dual specificity mitogen-activated protein kinase kinase 1
(Homo sapiens (Human))
BDBM50099988
(6-Methoxy-7-(3-morpholin-4-yl-propoxy)-4-[4-(pyrid...)
Show SMILES COc1cc2c(Nc3ccc(Oc4ccncc4)cc3)c(cnc2cc1OCCCN1CCOCC1)C#N
Show InChI InChI=1S/C29H29N5O4/c1-35-27-17-25-26(18-28(27)37-14-2-11-34-12-15-36-16-13-34)32-20-21(19-30)29(25)33-22-3-5-23(6-4-22)38-24-7-9-31-10-8-24/h3-10,17-18,20H,2,11-16H2,1H3,(H,32,33)
Reactome pathway
n/an/a 81n/an/an/an/an/an/a
Wyeth-Ayerst Research
Curated by ChEMBL
Assay Description
Inhibitory activity against Dual specificity mitogen-activated protein kinase kinase using direct MEK assay (which by-passes the need for activated R...
Bioorg Med Chem Lett 11: 1407-10 (2001)
BindingDB Entry DOI: 10.7270/Q2RB73WF