BDBM50100331 CHEMBL2371715::RO-09-3655 derivative
SMILES: [H][C@@]12C[C@@H](O)CN1C(=O)[C@@H](NC(=O)[C@H](Cc1ccc(O)cc1)NC(=O)[C@@H](C)NC(=O)[C@@]([H])(NC(=O)C[C@@H](CCCCCCCCCCCCC)OC(=O)[C@H](CCCN(CCCN)C(=O)[C@H](N)CCCN)NC(=O)[C@@]([H])(NC(=O)CNC(=O)[C@@]([H])(NC(=O)[C@]1([H])[C@@H](O)CCN1C(=O)[C@@]([H])(NC(=O)[C@@]([H])(NC2=O)[C@@H](C)O)[C@@H](C)O)[C@H](O)CC(N)=O)[C@@H](C)O)[C@@H](C)O)C(C)C
InChI Key: InChIKey=RQPFLMJGHVWEKS-HCKKGEAPSA-N
Data: 1 IC50
Activity Spreadsheet -- Enzyme Inhibition Constant Data from BindingDB
Found 1 hit for monomerid = 50100331
Trg + Lig
Ki
nM
ΔG°
kcal/mole
IC50
nM
Kd
nM
EC50/IC50
nM
koff
s-1
kon
M-1s-1
pHTemp
°C
Glucan Synthase
(Candida albicans (Yeast))
BDBM50100331
(CHEMBL2371715 | RO-09-3655 derivative)
Show SMILES [H][C@@]12C[C@@H](O)CN1C(=O)[C@@H](NC(=O)[C@H](Cc1ccc(O)cc1)NC(=O)[C@@H](C)NC(=O)[C@@]([H])(NC(=O)C[C@@H](CCCCCCCCCCCCC)OC(=O)[C@H](CCCN(CCCN)C(=O)[C@H](N)CCCN)NC(=O)[C@@]([H])(NC(=O)CNC(=O)[C@@]([H])(NC(=O)[C@]1([H])[C@@H](O)CCN1C(=O)[C@@]([H])(NC(=O)[C@@]([H])(NC2=O)[C@@H](C)O)[C@@H](C)O)[C@H](O)CC(N)=O)[C@@H](C)O)[C@@H](C)O)C(C)C
Show InChI InChI=1S/C79H133N17O24/c1-9-10-11-12-13-14-15-16-17-18-19-23-51-38-59(106)88-62(44(5)97)72(112)85-43(4)68(108)87-54(36-48-26-28-49(101)29-27-48)69(109)90-61(42(2)3)77(117)96-41-50(102)37-55(96)70(110)91-64(46(7)99)74(114)92-65(47(8)100)78(118)95-35-30-56(103)67(95)75(115)93-66(57(104)39-58(83)105)71(111)84-40-60(107)89-63(45(6)98)73(113)86-53(79(119)120-51)25-21-33-94(34-22-32-81)76(116)52(82)24-20-31-80/h26-29,42-47,50-57,61-67,97-104H,9-25,30-41,80-82H2,1-8H3,(H2,83,105)(H,84,111)(H,85,112)(H,86,113)(H,87,108)(H,88,106)(H,89,107)(H,90,109)(H,91,110)(H,92,114)(H,93,115)/t43-,44-,45-,46-,47-,50-,51-,52-,53+,54+,55+,56+,57-,61+,62+,63+,64+,65+,66+,67+/m1/s1
n/an/a 0.830n/an/an/an/an/an/a
Nippon Roche Research Center
Curated by ChEMBL
Assay Description
In vitro inhibitory activity against Beta glucan synthase
Bioorg Med Chem Lett 11: 1273-6 (2001)
BindingDB Entry DOI: 10.7270/Q2CN74FQ