null
SMILES: CCCCOC(=O)N[C@@H](CNC(=O)C1CCC2(CC1)CCN(CC2)c1ccncc1)C(O)=O
InChI Key: InChIKey=MBNNZQMWRRSBHP-FQEVSTJZSA-N
Activity Spreadsheet -- Enzyme Inhibition Constant Data from BindingDB
Found 1 hit for monomerid = 50100376
Trg + Lig
Ki
nM
ΔG°
kcal/mole
IC50
nM
Kd
nM
EC50/IC50
nM
koff
s-1
kon
M-1s-1
pHTemp
°C
Integrin alpha-IIb/beta-3
(Homo sapiens (Human))
BDBM50100376
((S)-2-Butoxycarbonylamino-3-[(3-pyridin-4-yl-3-aza...)
Show SMILES CCCCOC(=O)N[C@@H](CNC(=O)C1CCC2(CC1)CCN(CC2)c1ccncc1)C(O)=O
Show InChI InChI=1S/C24H36N4O5/c1-2-3-16-33-23(32)27-20(22(30)31)17-26-21(29)18-4-8-24(9-5-18)10-14-28(15-11-24)19-6-12-25-13-7-19/h6-7,12-13,18,20H,2-5,8-11,14-17H2,1H3,(H,26,29)(H,27,32)(H,30,31)/t20-/m0/s1
n/an/a 8n/an/an/an/an/an/a
COR Therapeutics, Inc
Curated by ChEMBL
Assay Description
In vitro inhibitory activity against blockage of binding of fibrinogen to purified human GPIIbIIIa
Bioorg Med Chem Lett 11: 1293-6 (2001)
BindingDB Entry DOI: 10.7270/Q2Z037DQ