BDBM50100979 Phosphoric acid di-((2Z,6E,10E)-3,7,11,15-tetramethyl-hexadeca-2,6,10,14-tetraenyl) ester
SMILES: [#6]\[#6](-[#6])=[#6]/[#6]-[#6]\[#6](-[#6])=[#6]\[#6]-[#6]\[#6](-[#6])=[#6]\[#6]-[#6]\[#6](-[#6])=[#6]/[#6]-[#8]P([#8-])(=O)[#8]P([#8-])([#8-])=O
InChI Key: InChIKey=OINNEUNVOZHBOX-KWBDAJKESA-K
Data: 1 IC50
Activity Spreadsheet -- Enzyme Inhibition Constant Data from BindingDB
Found 1 hit for monomerid = 50100979
Trg + Lig
Ki
nM
ΔG°
kcal/mole
IC50
nM
Kd
nM
EC50/IC50
nM
koff
s-1
kon
M-1s-1
pHTemp
°C
Geranylgeranyl transferase type I beta subunit/Protein Farnesyltransferase (PFT)
(Homo sapiens (Human))
BDBM50100979
(Phosphoric acid di-((2Z,6E,10E)-3,7,11,15-tetramet...)
Show SMILES [#6]\[#6](-[#6])=[#6]/[#6]-[#6]\[#6](-[#6])=[#6]\[#6]-[#6]\[#6](-[#6])=[#6]\[#6]-[#6]\[#6](-[#6])=[#6]/[#6]-[#8]P([#8-])(=O)[#8]P([#8-])([#8-])=O
Show InChI InChI=1S/C20H36O7P2/c1-17(2)9-6-10-18(3)11-7-12-19(4)13-8-14-20(5)15-16-26-29(24,25)27-28(21,22)23/h9,11,13,15H,6-8,10,12,14,16H2,1-5H3,(H,24,25)(H2,21,22,23)/p-3/b18-11+,19-13+,20-15-
n/an/a 100n/an/an/an/an/an/a
Wayne State University
Curated by ChEMBL
Assay Description
Binding affinity to 5-HT3 serotonin receptor in NG 108-15 neuroblastoma glioma cells using [3H]-GR-65,630 radioligand.
Bioorg Med Chem Lett 11: 1605-8 (2001)
BindingDB Entry DOI: 10.7270/Q26W9BM2