BDBM50101062 4-Chloro-9H-thioxanthene-9-carboxylic acid [(2R,3R,4S,5R)-5-(5-ethyl-2,4-dioxo-3,4-dihydro-2H-pyrimidin-1-yl)-4-fluoro-3-hydroxy-tetrahydro-furan-2-ylmethyl]-amide::CHEMBL295657
SMILES: CCc1cn([C@@H]2O[C@H](CNC(=O)C3c4ccccc4Sc4c(Cl)cccc34)[C@@H](O)[C@@H]2F)c(=O)[nH]c1=O
InChI Key: InChIKey=ZZONCTBBLSRPDS-HYEGPKIMSA-N
Data: 2 IC50
Activity Spreadsheet -- Enzyme Inhibition Constant Data from BindingDB
Found 2 hits for monomerid = 50101062
Trg + Lig
Ki
nM
ΔG°
kcal/mole
IC50
nM
Kd
nM
EC50/IC50
nM
koff
s-1
kon
M-1s-1
pHTemp
°C
Thymidine kinase
(Human herpesvirus 1 (strain SC16) (HHV-1) (Human h...)
BDBM50101062
(4-Chloro-9H-thioxanthene-9-carboxylic acid [(2R,3R...)
Show SMILES CCc1cn([C@@H]2O[C@H](CNC(=O)C3c4ccccc4Sc4c(Cl)cccc34)[C@@H](O)[C@@H]2F)c(=O)[nH]c1=O
Show InChI InChI=1S/C25H23ClFN3O5S/c1-2-12-11-30(25(34)29-22(12)32)24-19(27)20(31)16(35-24)10-28-23(33)18-13-6-3-4-9-17(13)36-21-14(18)7-5-8-15(21)26/h3-9,11,16,18-20,24,31H,2,10H2,1H3,(H,28,33)(H,29,32,34)/t16-,18?,19+,20-,24-/m1/s1
n/an/a 1.5n/an/an/an/an/an/a
Roche Discovery Welwyn
Curated by ChEMBL
Assay Description
Inhibitory activity against HSV-1 Thymidine Kinase (HSV-1 TK)
Bioorg Med Chem Lett 11: 1655-8 (2001)
BindingDB Entry DOI: 10.7270/Q2BZ65B6
Thymidine kinase
(Human herpesvirus 2)
BDBM50101062
(4-Chloro-9H-thioxanthene-9-carboxylic acid [(2R,3R...)
Show SMILES CCc1cn([C@@H]2O[C@H](CNC(=O)C3c4ccccc4Sc4c(Cl)cccc34)[C@@H](O)[C@@H]2F)c(=O)[nH]c1=O
Show InChI InChI=1S/C25H23ClFN3O5S/c1-2-12-11-30(25(34)29-22(12)32)24-19(27)20(31)16(35-24)10-28-23(33)18-13-6-3-4-9-17(13)36-21-14(18)7-5-8-15(21)26/h3-9,11,16,18-20,24,31H,2,10H2,1H3,(H,28,33)(H,29,32,34)/t16-,18?,19+,20-,24-/m1/s1
n/an/a 0.210n/an/an/an/an/an/a
Roche Discovery Welwyn
Curated by ChEMBL
Assay Description
Inhibitory activity against HSV-2 Thymidine Kinase (HSV-2 TK)
Bioorg Med Chem Lett 11: 1655-8 (2001)
BindingDB Entry DOI: 10.7270/Q2BZ65B6