BDBM50101171 2-(2-(3,5-Dimethyl-phenyl)-3-{2-[4-(4-methanesulfonylamino-phenyl)-butylamino]-ethyl}-1H-indol-5-yl)-N,N-diethyl-propionamide::CHEMBL42592
SMILES: CCN(CC)C(=O)C(C)c1ccc2[nH]c(c(CCNCCCCc3ccc(NS(C)(=O)=O)cc3)c2c1)-c1cc(C)cc(C)c1
InChI Key: InChIKey=YQEYJULPTBJTTD-UHFFFAOYSA-N
Data: 3 IC50
Activity Spreadsheet -- Enzyme Inhibition Constant Data from BindingDB
Found 3 hits for monomerid = 50101171
Trg + Lig
Ki
nM
ΔG°
kcal/mole
IC50
nM
Kd
nM
EC50/IC50
nM
koff
s-1
kon
M-1s-1
pHTemp
°C
Gonadotropin-releasing hormone receptor
(Rattus norvegicus)
BDBM50101171
(2-(2-(3,5-Dimethyl-phenyl)-3-{2-[4-(4-methanesulfo...)
Show SMILES CCN(CC)C(=O)C(C)c1ccc2[nH]c(c(CCNCCCCc3ccc(NS(C)(=O)=O)cc3)c2c1)-c1cc(C)cc(C)c1
Show InChI InChI=1S/C36H48N4O3S/c1-7-40(8-2)36(41)27(5)29-14-17-34-33(24-29)32(35(38-34)30-22-25(3)21-26(4)23-30)18-20-37-19-10-9-11-28-12-15-31(16-13-28)39-44(6,42)43/h12-17,21-24,27,37-39H,7-11,18-20H2,1-6H3
n/an/a 130n/an/an/an/an/an/a
Merck Research Laboratories
Curated by ChEMBL
Assay Description
Inhibition of [125I]-buserelin binding to rat pituitary Gonadotropin-releasing hormone receptor, in the presence of 0.1% bovine serum albumin.
Bioorg Med Chem Lett 11: 1723-6 (2001)
BindingDB Entry DOI: 10.7270/Q2KH0MK4
Gonadotropin-releasing hormone receptor
(Rattus norvegicus)
BDBM50101171
(2-(2-(3,5-Dimethyl-phenyl)-3-{2-[4-(4-methanesulfo...)
Show SMILES CCN(CC)C(=O)C(C)c1ccc2[nH]c(c(CCNCCCCc3ccc(NS(C)(=O)=O)cc3)c2c1)-c1cc(C)cc(C)c1
Show InChI InChI=1S/C36H48N4O3S/c1-7-40(8-2)36(41)27(5)29-14-17-34-33(24-29)32(35(38-34)30-22-25(3)21-26(4)23-30)18-20-37-19-10-9-11-28-12-15-31(16-13-28)39-44(6,42)43/h12-17,21-24,27,37-39H,7-11,18-20H2,1-6H3
n/an/a 2n/an/an/an/an/an/a
Merck Research Laboratories
Curated by ChEMBL
Assay Description
Inhibition of [125I]-buserelin binding to rat pituitary Gonadotropin-releasing hormone receptor, in the absence of bovine serum albumin (BSA)
Bioorg Med Chem Lett 11: 1723-6 (2001)
BindingDB Entry DOI: 10.7270/Q2KH0MK4
Gonadotropin-releasing hormone receptor
(Rattus norvegicus)
BDBM50101171
(2-(2-(3,5-Dimethyl-phenyl)-3-{2-[4-(4-methanesulfo...)
Show SMILES CCN(CC)C(=O)C(C)c1ccc2[nH]c(c(CCNCCCCc3ccc(NS(C)(=O)=O)cc3)c2c1)-c1cc(C)cc(C)c1
Show InChI InChI=1S/C36H48N4O3S/c1-7-40(8-2)36(41)27(5)29-14-17-34-33(24-29)32(35(38-34)30-22-25(3)21-26(4)23-30)18-20-37-19-10-9-11-28-12-15-31(16-13-28)39-44(6,42)43/h12-17,21-24,27,37-39H,7-11,18-20H2,1-6H3
n/an/a 0.200n/an/an/an/an/an/a
Merck Research Laboratories
Curated by ChEMBL
Assay Description
Inhibition of [125I]-buserelin binding to rat pituitary Gonadotropin-releasing hormone receptor, in the absence of bovine serum albumin (BSA)
Bioorg Med Chem Lett 11: 1723-6 (2001)
BindingDB Entry DOI: 10.7270/Q2KH0MK4